{"text_format":"1","workbook":"xlsx","n_sheets":8,"sheets":["INGRESO DE DATOS","Global Ultimate","Global Elite","Global Premier","Global Select","Global Major Medical","Resumen Tarifas","Tablas"],"not_rendered":{"charts":0,"images":18,"macros":1,"external_links":0,"defined_names":6,"comments":1,"pivot_tables":0},"unopened":[],"bounds":{"document_bytes":16777216,"sheet_cells":100000,"rows_first":2000,"rows_last":500,"rows_between":2000,"halvings":0,"cell_chars":16384,"cell_head_chars":4096},"cells_cut":0,"cells_raw":0,"read":"whole","date_system":"1900"}

{"sheet":"INGRESO DE DATOS","index":0,"n_rows":47,"n_cols":25,"rows_kept":47,"cut":false,"hidden":false,"merged":[[43,11,46,12],[44,14,44,18],[55,3,55,4],[55,6,55,7],[44,0,44,1],[38,0,38,1],[40,0,40,1],[42,0,42,1],[10,18,17,18],[41,7,41,9],[38,4,40,5],[41,4,41,5],[38,7,40,9],[41,14,41,16],[21,20,21,24],[10,14,10,16],[36,2,36,12],[21,14,21,18],[36,14,36,18],[10,0,10,12],[14,10,14,12],[36,0,36,1]]}
[]
[null,null,null,null,null,null,null," "," ",null,null,null,null,null,"24 years",false]
[null,null,null,null,null,null,null,null,null,null,null,null,null,null,"Coaseguro (Panamá)",false]
[]
[]
[null,null,null,null,null,null,null," "," "]
[]
[]
[]
[]
[null,null,null,null,null,null,null,null,null,null,null,null,null,null,"Descuento 24 años (por edad)",null,null,null,"Type","Nuevo Negocio"]
[null,null,null,null,null,null,null,null,null,null,null,null,null,null,"age","Discount (%)","Parameter",null,null,"Renovación"]
[null,null,null,null,null,null,null,null,null,null,null,null,null,null,24,35,{"$f":"1-P13/100","v":0.65},null,null,"Renovación: 2020"]
[null,null,null,null,null,null,null,null,null,null,null,null,null,null,25,30,{"$f":"1-P14/100","v":0.7}]
[null,null,null,null,null,null,null,null,null,null,null,null,null,null,26,25,0.75]
[null,null,null,null,null,null,null,null,null,null,null,null,null,null,27,20,0.8]
[null,null,null,null,null,null,null,null,null,null,null,null,null,null,28,15,0.85]
[null,null,null,null,null,null,null,null,null,null,null,null,null,null,29,6,0.94]
[null,null,null,null,null,null,null,null,null,null,null,null,null,null,"All ages",0,1,null,"Type selected",1]
[]
[null,null,null,null,null,null,null,false]
[null,null,null,null,null,null,null,null,null,null,null,null,null,null,"NEW BUSINESS DISCOUNT (ENTRADA MANUAL)",null,null,null,null,null,"POLIZAS 2020 (ENTRADA MANUAL)"]
[null,null,null,null,null,null,null,null,null,null,null,null,null,null,"Ultimate","Elite","Premier","Select","Major Medical",null,"Ultimate","Elite","Premier","Select","Major Medical"]
[null,null,null,null,null,null,null,null,null,null,null,null,null,null,0,15,25,15,15,null,0,15,15,15,15]
[]
[]
[]
[]
[]
[null,null,null,null,null,null,null,null,null,null,null,null,null,null,"Descuento de 24 años:",{"$f":"IF(P2,_xlfn.SWITCH(C43,O13,Q13,O14,Q14,O15,Q15,O16,Q16,O17,Q17,O18,Q18,Q19),Q19)","v":1},null,"IVA (12%)",{"$f":"12/100","v":0.12},{"$f":"S30+1","v":1.1200000000000001}]
{"$rows_left_out":18}
{"sheet":"Global Ultimate","index":1,"n_rows":80,"n_cols":22,"rows_kept":80,"cut":false,"hidden":false,"merged":[[16,2,16,3],[79,0,82,3],[30,0,30,1],[4,0,10,4],[12,1,12,4],[22,1,22,2],[23,0,23,4],[26,0,26,1],[27,0,27,1],[29,0,29,4],[43,0,43,1],[31,0,31,1],[32,0,32,1],[33,0,33,1],[34,0,34,1],[35,0,35,1],[36,0,36,1],[61,0,61,1],[62,0,62,1],[37,0,37,1],[38,0,38,1],[40,0,40,4],[41,0,41,1],[42,0,42,1],[0,7,0,12],[0,14,0,19],[68,0,68,1],[69,0,69,1],[56,0,56,1],[44,0,44,1],[45,0,45,1],[46,0,46,1],[47,0,47,1],[48,0,48,1],[49,0,49,1],[50,0,50,1],[51,0,51,1],[53,0,53,4],[54,0,54,1],[55,0,55,1],[0,21,0,26],[77,0,77,1],[71,0,71,1],[72,0,72,1],[73,0,73,1],[74,0,74,1],[75,0,75,1],[76,0,76,1],[70,0,70,1],[57,0,57,1],[58,0,58,1],[59,0,59,1],[60,0,60,1],[63,0,63,1],[66,0,66,4],[67,0,67,1]]}
[null,null,false,null,null,null,null,"RESUMEN DE BENEFICIOS",null,null,null,null,null,null,"RESUMEN DE BENEFICIOS",null,null,null,null,null,null,"RESUMEN DE BENEFICIOS"]
[]
[]
[]
["Cotización de Seguro Médico Internacional\nGlobal Ultimate Health Plan\nTarifas en US$ | Validas: 1 de enero de 2024"]
[]
[]
[]
[]
[]
[]
[]
["Nombre del Asegurado Titular",{"$f":"+'INGRESO DE DATOS'!$C$37","v":"John Doe"}]
[]
["Número de adultos en la póliza",{"$f":"+'INGRESO DE DATOS'!$C$41","v":2}]
[]
["Número de Dependientes en la póliza",{"$f":"+'INGRESO DE DATOS'!$C$39","v":2},{"$f":"IF('INGRESO DE DATOS'!$P$2=TRUE, \"Cotización para dependiente de 24 años\",\"\")","v":""}]
[]
["Número de Dependientes menores de 16 años",{"$f":"+'INGRESO DE DATOS'!$E$42","v":1}]
[]
["Edad del Asegurado Titular",{"$f":"+'INGRESO DE DATOS'!$C$43","v":32},"Edad del/la conyuge",{"$f":"+'INGRESO DE DATOS'!$C$45","v":46}]
[]
["Fecha de la cotización",{"$f":"NOW()","v":"2024-01-09T14:34:53.990"}]
[]
[]
["DEDUCIBLES",null,"PLAN 1","PLAN 2","PLAN 3"]
["En el país de residencia",null,"$0",1000,2000]
["Fuera del país de residencia",null,"$0",1000,2000]
[]
["TARIFAS ANUALES"]
{"$rows_left_out":51}
{"sheet":"Global Elite","index":2,"n_rows":85,"n_cols":24,"rows_kept":85,"cut":false,"hidden":false,"merged":[[78,0,78,1],[79,0,79,1],[80,0,80,1],[81,0,81,1],[82,0,82,1],[84,0,88,6],[74,0,74,1],[60,0,60,1],[24,0,24,1],[75,0,75,1],[76,0,76,1],[77,0,77,1],[59,0,59,1],[63,0,63,1],[64,0,64,1],[71,0,71,1],[72,0,72,1],[73,0,73,1],[56,0,56,6],[68,0,68,1],[67,0,67,1],[66,0,66,1],[65,0,65,1],[70,0,70,6],[62,0,62,1],[61,0,61,1],[58,0,58,1],[50,0,50,1],[40,0,40,1],[54,0,54,1],[53,0,53,1],[52,0,52,1],[51,0,51,1],[46,0,46,1],[47,0,47,1],[48,0,48,1],[49,0,49,1],[39,0,39,1],[45,0,45,1],[57,0,57,1],[35,0,35,1],[36,0,36,1],[42,0,42,6],[43,0,43,1],[44,0,44,1],[37,0,37,1],[38,0,38,1],[0,9,0,14],[0,16,0,21],[0,23,0,28],[34,0,34,1],[4,0,10,6],[12,1,12,6],[20,4,20,5],[22,1,22,3],[27,0,27,1],[28,0,28,1],[30,0,30,6],[31,0,31,1],[32,0,32,1],[33,0,33,1],[16,2,16,3]]}
[null,null,null,null,null,null,null,null,null,"RESUMEN DE BENEFICIOS",null,null,null,null,null,null,"RESUMEN DE BENEFICIOS",null,null,null,null,null,null,"RESUMEN DE BENEFICIOS"]
[]
[]
[]
["Cotización de Seguro Médico Internacional\nGlobal Elite Health Plan\nTarifas en US$ | Validas: 1 de enero de 2024"]
[]
[]
[]
[]
[]
[]
[]
["Nombre del Asegurado Titular",{"$f":"+'INGRESO DE DATOS'!$C$37","v":"John Doe"}]
[]
["Número de adultos en la póliza",{"$f":"+'INGRESO DE DATOS'!$C$39","v":2}]
[]
["Número de Dependientes en la póliza",{"$f":"+'INGRESO DE DATOS'!$C$41","v":2},{"$f":"IF('INGRESO DE DATOS'!$P$2=TRUE, \"Cotización para dependiente de 24 años\",\"\")","v":""}]
[]
["Número de Dependientes menores de 10 años",{"$f":"+'INGRESO DE DATOS'!$H$42","v":1}]
[]
["Edad del Asegurado Titular",{"$f":"+'INGRESO DE DATOS'!$C$43","v":32},null,null,"Edad del/la conyuge",null,{"$f":"+'INGRESO DE DATOS'!$C$45","v":46}]
[]
["Fecha de la cotización",{"$f":"NOW()","v":"2024-01-09T14:34:53.990"}]
[]
[{"$f":"IF('INGRESO DE DATOS'!P3=TRUE,\"Variante con coaseguro fuera del país de residencia: SI\",\"Variante con coaseguro fuera del país de residencia: NO\")","v":"Variante con coaseguro fuera del país de residencia: NO"}]
[]
["DEDUCIBlES",null,"PLAN 1","PLAN 2","PLAN 3","PLAN 4","PLAN 5"]
["En el país de residencia",null,250,2000,3500,5000,10000]
["Fuera del país de residencia",null,5000,2000,3500,5000,10000]
[]
{"$rows_left_out":56}
{"sheet":"Global Premier","index":3,"n_rows":79,"n_cols":23,"rows_kept":79,"cut":false,"hidden":false,"merged":[[73,0,73,1],[22,0,22,2],[78,0,81,5],[65,0,65,5],[66,0,66,1],[67,0,67,1],[68,0,68,1],[72,0,72,1],[39,0,39,5],[40,0,40,1],[41,0,41,1],[42,0,42,1],[45,0,45,1],[30,0,30,1],[31,0,31,1],[34,0,34,1],[35,0,35,1],[36,0,36,1],[0,0,3,5],[4,0,10,5],[12,1,12,5],[18,3,18,4],[16,2,16,3],[69,0,69,1],[71,0,71,1],[44,0,44,1],[57,0,57,1],[70,0,70,1],[56,0,56,1],[58,0,58,1],[46,0,46,1],[47,0,47,1],[52,0,52,5],[53,0,53,1],[54,0,54,1],[55,0,55,1],[59,0,59,1],[60,0,60,1],[0,8,0,13],[0,15,0,20],[0,22,0,27],[33,0,33,1],[20,1,20,2],[25,0,25,1],[26,0,26,1],[28,0,28,5],[29,0,29,1]]}
[" ",null,null,null,null,null,null,null,"RESUMEN DE BENEFICIOS",null,null,null,null,null,null,"RESUMEN DE BENEFICIOS",null,null,null,null,null,null,"RESUMEN DE BENEFICIOS"]
[]
[]
[]
["Cotización de Seguro Médico Internacional\nGlobal Premier Health Plan\nTarifas en US$ | Validas: 1 de enero de 2024"]
[]
[]
[]
[]
[]
[]
[]
["Nombre del Asegurado Titular",{"$f":"+'INGRESO DE DATOS'!$C$37","v":"John Doe"}]
[]
["Número de adultos en la póliza",{"$f":"+'INGRESO DE DATOS'!$C$39","v":2}]
[]
["Número de Dependientes en la póliza",{"$f":"+'INGRESO DE DATOS'!$C$41","v":2},{"$f":"IF('INGRESO DE DATOS'!$P$2=TRUE, \"Cotización para dependiente de 24 años\",\"\")","v":""}]
[]
["Edad del Asegurado Titular",{"$f":"+'INGRESO DE DATOS'!$C$43","v":32},null,"Edad del/la conyuge",null,{"$f":"+'INGRESO DE DATOS'!$C$45","v":46}]
[]
["Fecha de la cotización",{"$f":"NOW()","v":"2024-01-09T14:34:53.990"}]
[]
[{"$f":"IF('INGRESO DE DATOS'!P3=TRUE,\"Variante con coaseguro fuera del país de residencia: SI\",\"Variante con coaseguro fuera del país de residencia: NO\")","v":"Variante con coaseguro fuera del país de residencia: NO"}]
[null,null," ",null,null," "]
["Deducibles",null,"PLAN 1","PLAN 2","PLAN 3","PLAN 4"]
["En el país de residencia",null,250,2000,5000,10000]
["Fuera del país de residencia",null,5000,2000,5000,10000]
[]
["TARIFAS ANUALES"]
["Prima para Asegurado Titular",null,{"$f":"VLOOKUP($B$19,Tablas!$A$156:$G$222,3,TRUE)","v":5500.5},{"$f":"VLOOKUP($B$19,Tablas!$A$156:$G$222,4,TRUE)","v":4992.75},{"$f":"VLOOKUP($B$19,Tablas!$A$156:$G$222,5,TRUE)","v":3601.5},{"$f":"VLOOKUP($B$19,Tablas!$A$156:$G$222,6,TRUE)","v":2607.75}]
{"$rows_left_out":50}
{"sheet":"Global Select","index":4,"n_rows":79,"n_cols":16,"rows_kept":79,"cut":false,"hidden":false,"merged":[[16,2,16,3],[78,0,81,5],[40,0,40,1],[41,0,41,1],[42,0,42,1],[45,0,45,1],[46,0,46,1],[58,0,58,1],[69,0,69,1],[71,0,71,1],[59,0,59,1],[60,0,60,1],[65,0,65,5],[66,0,66,1],[67,0,67,1],[68,0,68,1],[74,0,74,1],[75,0,75,1],[76,0,76,1],[44,0,44,1],[57,0,57,1],[70,0,70,1],[47,0,47,1],[48,0,48,1],[49,0,49,1],[50,0,50,1],[52,0,52,5],[53,0,53,1],[54,0,54,1],[55,0,55,1],[56,0,56,1],[63,0,63,1],[31,0,31,1],[73,0,73,1],[34,0,34,1],[35,0,35,1],[36,0,36,1],[37,0,37,1],[39,0,39,5],[72,0,72,1],[0,8,0,13],[0,15,0,20],[0,22,0,27],[61,0,61,1],[62,0,62,1],[4,0,10,5],[20,1,20,2],[12,1,12,5],[18,3,18,4],[22,0,22,2],[25,0,25,1],[26,0,26,1],[28,0,28,5],[29,0,29,1],[33,0,33,1],[30,0,30,1]]}
[" ",null,null,null,null,null,null,null,"RESUMEN DE BENEFICIOS",null,null,null,null,null,null,"RESUMEN DE BENEFICIOS"]
[]
[]
[]
["Cotización de Seguro Médico Internacional\nGlobal Select Health Plan\nTarifas en US$ | Validas: 1 de enero de 2024"]
[]
[]
[]
[]
[]
[]
[]
["Nombre del Asegurado Titular",{"$f":"+'INGRESO DE DATOS'!$C$37","v":"John Doe"}]
[]
["Número de adultos en la póliza",{"$f":"+'INGRESO DE DATOS'!$C$39","v":2}]
[]
["Número de Dependientes en la póliza",{"$f":"+'INGRESO DE DATOS'!$C$41","v":2},{"$f":"IF('INGRESO DE DATOS'!$P$2=TRUE, \"Cotización para dependiente de 24 años\",\"\")","v":""}]
[]
["Edad del Asegurado Titular",{"$f":"+'INGRESO DE DATOS'!$C$43","v":32},null,"Edad del/la conyuge",null,{"$f":"+'INGRESO DE DATOS'!$C$45","v":46}]
[]
["Fecha de la cotización",{"$f":"NOW()","v":"2024-01-09T14:34:53.990"}]
[]
[{"$f":"IF('INGRESO DE DATOS'!P3=TRUE,\"Variante con coaseguro fuera del país de residencia: SI\",\"Variante con coaseguro fuera del país de residencia: NO\")","v":"Variante con coaseguro fuera del país de residencia: NO"}]
[]
["DEDUCIBLES",null,"PLAN 1","PLAN 2","PLAN 3","PLAN 4"]
["En el país de residencia",null,250,2000,5000,10000]
["Fuera del país de residencia",null,5000,2000,5000,10000]
[]
["TARIFAS ANUALES"]
["Prima para Asegurado Titular",null,{"$f":"VLOOKUP($B$19,Tablas!$A$307:$G$373,3,TRUE)","v":5816.55},{"$f":"VLOOKUP($B$19,Tablas!$A$307:$G$373,4,TRUE)","v":5581.95},{"$f":"VLOOKUP($B$19,Tablas!$A$307:$G$373,5,TRUE)","v":4044.2999999999997},{"$f":"VLOOKUP($B$19,Tablas!$A$307:$G$373,6,TRUE)","v":2930.7999999999997}]
{"$rows_left_out":50}
{"sheet":"Global Major Medical","index":5,"n_rows":73,"n_cols":14,"rows_kept":73,"cut":false,"hidden":false,"merged":[[50,0,50,1],[51,0,51,1],[54,0,54,1],[55,0,55,1],[60,0,60,3],[72,0,77,3],[68,0,68,1],[69,0,69,1],[70,0,70,1],[61,0,61,1],[62,0,62,1],[63,0,63,1],[66,0,66,1],[67,0,67,1],[64,0,64,1],[65,0,65,1],[45,0,45,1],[46,0,46,1],[49,0,49,1],[0,6,0,11],[39,0,39,1],[41,0,41,1],[42,0,42,1],[43,0,43,1],[44,0,44,1],[33,0,33,1],[34,0,34,1],[36,0,36,3],[37,0,37,1],[38,0,38,1],[16,2,16,3],[0,13,0,18],[26,0,26,3],[52,0,52,1],[53,0,53,1],[27,0,27,1],[28,0,28,1],[29,0,29,1],[31,0,31,1],[0,0,3,3],[4,0,10,3],[12,1,12,3],[23,0,23,1],[24,0,24,1],[20,1,20,2],[32,0,32,1],[48,0,48,3]]}
[" ",null,null,null,null,null,"RESUMEN DE BENEFICIOS",null,null,null,null,null,null,"RESUMEN DE BENEFICIOS"]
[]
[null,null,null,null," "]
[]
[" Cotización de Seguro Médico Internacional\nGlobal Major Medical\nHealth Plan\nTarifas en US$ | Validas: 1 de enero de 2024"]
[]
[null,null,null,null," "]
[]
[]
[]
[]
[]
["Nombre del Asegurado Titular",{"$f":"+'INGRESO DE DATOS'!$C$37","v":"John Doe"}]
[]
["Número de adultos en la póliza",{"$f":"+'INGRESO DE DATOS'!$C$39","v":2}]
[]
["Número de Dependientes en la póliza",{"$f":"+'INGRESO DE DATOS'!$C$41","v":2},{"$f":"IF('INGRESO DE DATOS'!$P$2=TRUE, \"Cotización para dependiente de 24 años\",\"\")","v":""}]
[]
["Edad del Asegurado Titular",{"$f":"+'INGRESO DE DATOS'!$C$43","v":32},"Edad del/la conyuge",{"$f":"+'INGRESO DE DATOS'!$C$45","v":46}]
[]
["Fecha de la cotización",{"$f":"NOW()","v":"2024-01-09T14:34:53.990"}]
[]
["DEDUCIBLeS",null,"PLAN 1","PLAN 2"]
["En el país de residencia",null,10000,20000]
["Fuera del país de residencia",null,10000,20000]
[]
["TARIFAS ANUALES"]
["Prima para Asegurado Titular",null,{"$f":"VLOOKUP($B$19,Tablas!$A$1138:$G$1204,3,TRUE)","v":3435.7},{"$f":"VLOOKUP($B$19,Tablas!$A$1138:$G$1204,4,TRUE)","v":2616.2999999999997}]
["Prima para conyuge",null,{"$f":"IF($B$15=1,0,(VLOOKUP($D$19,Tablas!$A$1138:$G$1204,3,TRUE)))","v":4723.45},{"$f":"IF($B$15=1,0,(VLOOKUP($D$19,Tablas!$A$1138:$G$1204,4,TRUE)))","v":3581.0499999999997}]
["Prima para hijo (s)",null,{"$f":"IF($B$17=0,0,(VLOOKUP($B$17,Tablas!$A$1205:$G$1207,3,TRUE)))","v":2068.9},{"$f":"IF($B$17=0,0,(VLOOKUP($B$17,Tablas!$A$1205:$G$1207,4,TRUE)))","v":1625.2}]
{"$rows_left_out":44}
{"sheet":"Resumen Tarifas","index":6,"n_rows":90,"n_cols":6,"rows_kept":90,"cut":false,"hidden":false,"merged":[[16,2,16,3],[22,0,22,2],[89,0,96,5],[0,0,3,5],[4,0,10,5],[20,1,20,2],[12,1,12,5],[40,0,47,0],[54,0,61,0],[67,0,74,0],[80,0,87,0],[50,5,61,5],[22,4,34,5],[63,5,74,5],[76,3,87,5],[71,1,71,4],[26,0,33,0],[44,1,44,5],[46,1,46,5],[50,0,50,4],[40,1,40,5],[42,1,42,5],[26,1,26,2],[28,1,28,2],[30,1,30,2],[32,1,32,2],[86,1,86,2],[36,0,36,5],[76,0,76,2],[82,1,82,2],[84,1,84,2],[54,1,54,4],[56,1,56,4],[58,1,58,4],[60,1,60,4],[63,0,63,4],[67,1,67,4],[69,1,69,4],[80,1,80,2],[73,1,73,4]]}
[" "]
[]
[]
[]
["Cotización de Seguro Médico Internacional\nBupa Global Major Health Plans\nResumen de Tarifas\nTarifas en US$ | Validas: 1 de enero de 2024"]
[]
[]
[]
[]
[]
[]
[]
["Nombre del Asegurado Titular",{"$f":"+'INGRESO DE DATOS'!$C$37","v":"John Doe"}]
[]
["Número de adultos en la póliza",{"$f":"+'INGRESO DE DATOS'!$C$39","v":2}]
[]
["Número de Dependientes en la póliza",{"$f":"+'INGRESO DE DATOS'!$C$41","v":2},{"$f":"IF('INGRESO DE DATOS'!$P$2=TRUE, \"Cotización para dependiente de 24 años\",\"\")","v":""}]
[]
["Edad del Asegurado Titular",{"$f":"+'INGRESO DE DATOS'!$C$43","v":32},null,null,"Edad del/la conyuge",{"$f":"+'INGRESO DE DATOS'!$C$45","v":46}]
[]
["Fecha de la cotización",{"$f":"NOW()","v":"2024-01-09T14:34:53.990"}]
[]
["GLOBAL ULTIMATE HEALTH PLAN"]
["DEDUCIBLES","PLAN 1","PLAN 2"]
["En el país de residencia","$0",1000]
["Fuera del país de residencia","$0",1000]
[null,"TARIFAS ANUALES"]
[null,{"$f":"'Global Ultimate'!C38","v":115032.95999999999},{"$f":"'Global Ultimate'!D38","v":74248.160000000003}]
[null,"TARIFAS SEMESTRALES"]
[null,{"$f":"'Global Ultimate'!C50","v":60922.948800000006},{"$f":"'Global Ultimate'!D50","v":39307.004800000002}]
{"$rows_left_out":61}
{"sheet":"Tablas","index":7,"n_rows":1508,"n_cols":19,"rows_kept":1508,"cut":false,"hidden":true,"merged":[[1435,0,1435,6],[1437,0,1437,1],[1436,2,1436,6],[1357,0,1357,6],[1358,0,1358,6],[1360,0,1360,1],[1359,2,1359,6],[1434,0,1434,6],[1210,0,1210,1],[1209,2,1209,6],[1282,0,1282,6],[1283,0,1283,6],[1285,0,1285,1],[1284,2,1284,6],[1133,0,1133,6],[1134,0,1134,6],[1136,0,1136,1],[1135,2,1135,6],[1208,0,1208,6],[984,0,984,1],[983,2,983,6],[1056,0,1056,6],[1057,0,1057,6],[1059,0,1059,1],[1058,2,1058,6],[907,0,907,6],[908,0,908,6],[910,0,910,1],[909,2,909,6],[982,0,982,6],[1,0,1,6],[2,0,2,6],[78,0,78,1],[77,2,77,6],[76,0,76,6],[4,0,4,1],[3,2,3,6],[153,2,153,6],[226,0,226,6],[228,0,228,1],[377,0,377,6],[227,2,227,6],[302,0,302,6],[303,0,303,6],[305,0,305,1],[304,2,304,6],[833,0,833,1],[832,2,832,6],[756,0,756,6],[680,0,680,6],[681,0,681,6],[683,0,683,1],[682,2,682,6],[755,0,755,6],[831,0,831,6],[531,0,531,1],[530,2,530,6],[603,0,603,6],[604,0,604,6],[605,0,605,1],[605,2,605,6],[1,20,1,22],[63,7,65,7],[758,0,758,1],[757,2,757,6],[830,0,830,6],[529,0,529,6],[453,0,453,6],[454,0,454,6],[456,0,456,1],[455,2,455,6],[528,0,528,6],[379,0,379,1],[378,2,378,6],[151,0,151,6],[152,0,152,6],[154,0,154,1],[4,8,4,12],[4,14,4,18],[2,12,2,13],[3,12,3,13],[1,8,1,9],[1136,8,1136,9],[1136,11,1136,12],[154,8,154,11],[154,13,154,16],[305,8,305,11],[305,13,305,16],[910,8,910,10],[910,12,910,14]]}
[]
["BUPA GLOBAL ELITE",null,null,null,null,null,null,null,"FACTOR MENSUAL:",null,9.3333333333333338E-2,null,"Descuento de 24 años",{"$f":"'INGRESO DE DATOS'!P30","v":1},"Ultimate","Elite","Premier","Select","Major Medical"]
["TARIFAS ANUALES",null,null,null,null,null,null,null,"FACTOR TRIMESTRAL:",null,0.27500000000000002,null,"Descuento de producto (%)",null,{"$f":"'INGRESO DE DATOS'!O39","v":0},{"$f":"'INGRESO DE DATOS'!P39","v":0.15},{"$f":"'INGRESO DE DATOS'!Q39","v":0.25},{"$f":"'INGRESO DE DATOS'!R39","v":0.15},{"$f":"'INGRESO DE DATOS'!S39","v":0.15}]
[null,null,null,null,null,null,null,null,"FACTOR SEMIANUAL:",null,0.53,null,"Factor para el descuento combinado",null,{"$f":"'INGRESO DE DATOS'!O47","v":1},{"$f":"'INGRESO DE DATOS'!P47","v":0.85},{"$f":"'INGRESO DE DATOS'!Q47","v":0.75},{"$f":"'INGRESO DE DATOS'!R47","v":0.85},{"$f":"'INGRESO DE DATOS'!S47","v":0.85}]
["EDAD",null,1000,2000,3500,5000,10000,null,"TARIFAS BASE",null,null,null,null,null,"TARIFAS BASE CON DESCUENTO"]
[18,null,{"$f":"O6","v":9838.75},{"$f":"P6","v":8621.5499999999993},7123.8499999999995,6174.4,4668.2,null,11575,10143,8381,7264,5492,null,{"$f":"I6*$P$4","v":9838.75},{"$f":"J6*$P$4","v":8621.5499999999993},7123.8499999999995,6174.4,4668.2]
[19,null,{"$f":"O7","v":9956.9},{"$f":"P7","v":8727.7999999999993},{"$f":"Q7","v":7198.65},{"$f":"R7","v":6244.0999999999995},{"$f":"S7","v":4719.2},null,11714,10268,8469,7346,5552,null,{"$f":"I7*$P$4","v":9956.9},{"$f":"J7*$P$4","v":8727.7999999999993},{"$f":"K7*$P$4","v":7198.65},{"$f":"L7*$P$4","v":6244.0999999999995},{"$f":"M7*$P$4","v":4719.2}]
[20,null,10084.4,8835.75,7277.7,6310.4,4768.5,null,11864,10395,8562,7424,5610,null,10084.4,8835.75,7277.7,6310.4,4768.5]
[21,null,10209.35,8949.65,7359.3,6381.8,4823.75,null,12011,10529,8658,7508,5675,null,10209.35,8949.65,7359.3,6381.8,4823.75]
[22,null,10341.949999999999,9064.4,7446,6456.5999999999995,4879,null,12167,10664,8760,7596,5740,null,10341.949999999999,9064.4,7446,6456.5999999999995,4879]
[23,null,10477.949999999999,9187.65,7535.25,6533.0999999999995,4937.6499999999996,null,12327,10809,8865,7686,5809,null,10477.949999999999,9187.65,7535.25,6533.0999999999995,4937.6499999999996]
[24,null,10619.05,9311.75,7624.5,6612.15,4997.1499999999996,null,12493,10955,8970,7779,5879,null,10619.05,9311.75,7624.5,6612.15,4997.1499999999996]
[25,null,10767.8,9437.5499999999993,7717.15,6691.2,5059.2,null,12668,11103,9079,7872,5952,null,10767.8,9437.5499999999993,7717.15,6691.2,5059.2]
[26,null,10978.6,9622,7857.4,6813.5999999999995,5149.3,null,12916,11320,9244,8016,6058,null,10978.6,9622,7857.4,6813.5999999999995,5149.3]
[27,null,11197.05,9816.65,8000.2,6938.55,5242.8,null,13173,11549,9412,8163,6168,null,11197.05,9816.65,8000.2,6938.55,5242.8]
[28,null,11427.4,10018.1,8150.65,7066.9,5342.25,null,13444,11786,9589,8314,6285,null,11427.4,10018.1,8150.65,7066.9,5342.25]
[29,null,11666.25,10226.35,8308.75,7204.5999999999995,5443.4,null,13725,12031,9775,8476,6404,null,11666.25,10226.35,8308.75,7204.5999999999995,5443.4]
[30,null,11911.05,10442.25,8473.65,7348.25,5552.2,null,14013,12285,9969,8645,6532,null,11911.05,10442.25,8473.65,7348.25,5552.2]
[31,null,12168.6,10669.199999999999,8637.6999999999989,7491.9,5660.15,null,14316,12552,10162,8814,6659,null,12168.6,10669.199999999999,8637.6999999999989,7491.9,5660.15]
[32,null,12430.4,10895.3,8818.75,7647.45,5777.45,null,14624,12818,10375,8997,6797,null,12430.4,10895.3,8818.75,7647.45,5777.45]
[33,null,12706.65,11138.4,8996.4,7803.8499999999995,5896.45,null,14949,13104,10584,9181,6937,null,12706.65,11138.4,8996.4,7803.8499999999995,5896.45]
[34,null,12988.85,11381.5,9185.1,7967.9,6018,null,15281,13390,10806,9374,7080,null,12988.85,11381.5,9185.1,7967.9,6018]
[35,null,13277.85,11638.199999999999,9380.6,8134.5,6147.2,null,15621,13692,11036,9570,7232,null,13277.85,11638.199999999999,9380.6,8134.5,6147.2]
[36,null,13576.199999999999,11899.15,9577.7999999999993,8307.0499999999993,6274.7,null,15972,13999,11268,9773,7382,null,13576.199999999999,11899.15,9577.7999999999993,8307.0499999999993,6274.7]
[37,null,13883.05,12169.449999999999,9789.4499999999989,8488.9499999999989,6414.95,null,16333,14317,11517,9987,7547,null,13883.05,12169.449999999999,9789.4499999999989,8488.9499999999989,6414.95]
[38,null,14201.8,12448.25,10001.949999999999,8673.4,6551.8,null,16708,14645,11767,10204,7708,null,14201.8,12448.25,10001.949999999999,8673.4,6551.8]
[39,null,14524.8,12731.3,10221.25,8862.1,6698,null,17088,14978,12025,10426,7880,null,14524.8,12731.3,10221.25,8862.1,6698]
[40,null,14856.3,13024.55,10443.949999999999,9057.6,6845.05,null,17478,15323,12287,10656,8053,null,14856.3,13024.55,10443.949999999999,9057.6,6845.05]
[41,null,15201.4,13325.449999999999,10678.55,9258.1999999999989,6997.2,null,17884,15677,12563,10892,8232,null,15201.4,13325.449999999999,10678.55,9258.1999999999989,6997.2]
[42,null,15554.15,13630.6,10918.25,9468.15,7153.5999999999995,null,18299,16036,12845,11139,8416,null,15554.15,13630.6,10918.25,9468.15,7153.5999999999995]
{"$rows_left_out":1478}