{"text_format":"1","workbook":"xlsx","n_sheets":4,"sheets":["INGRESO DE DATOS","BUPA ESSENTIAL CARE","RESUMEN DE TARIFAS","Tablas"],"not_rendered":{"charts":0,"images":5,"macros":1,"external_links":0,"defined_names":2,"comments":1,"pivot_tables":0},"unopened":[],"bounds":{"document_bytes":16777216,"sheet_cells":100000,"rows_first":2000,"rows_last":500,"rows_between":2000,"halvings":0,"cell_chars":16384,"cell_head_chars":4096},"cells_cut":0,"cells_raw":0,"read":"whole","date_system":"1900"}

{"sheet":"INGRESO DE DATOS","index":0,"n_rows":47,"n_cols":20,"rows_kept":47,"cut":false,"hidden":false,"merged":[[55,3,55,4],[55,6,55,7],[10,0,10,12],[44,0,44,1],[36,0,36,1],[38,0,38,1],[40,0,40,1],[42,0,42,1],[14,10,14,12],[38,4,40,5],[41,4,41,5],[38,7,40,9],[41,7,41,9],[10,14,10,16],[36,2,36,12],[21,14,21,18],[36,14,36,18],[44,14,44,18],[10,18,17,18],[41,14,41,16]]}
[]
[null,null,null,null,null,null,null," "," ",null,null,null,null,null,"24 years",false]
[null,null,null,null,null,null,null,null,null,null,null,null,null,null,"Coaseguro (Panamá)",false]
[]
[]
[null,null,null,null,null,null,null," "," "]
[]
[]
[]
[]
[null,null,null,null,null,null,null,null,null,null,null,null,null,null,"Descuento 24 años (por edad)",null,null,null,"Type","Nuevo Negocio"]
[null,null,null,null,null,null,null,null,null,null,null,null,null,null,"age","Discount (%)","Parameter",null,null,"Renovación"]
[null,null,null,null,null,null,null,null,null,null,null,null,null,null,24,35,{"$f":"1-P13/100","v":0.65}]
[null,null,null,null,null,null,null,null,null,null,null,null,null,null,25,30,{"$f":"1-P14/100","v":0.7}]
[null,null,null,null,null,null,null,null,null,null,null,null,null,null,26,25,0.75]
[null,null,null,null,null,null,null,null,null,null,null,null,null,null,27,20,0.8]
[null,null,null,null,null,null,null,null,null,null,null,null,null,null,28,15,0.85]
[null,null,null,null,null,null,null,null,null,null,null,null,null,null,29,6,0.94]
[null,null,null,null,null,null,null,null,null,null,null,null,null,null,"All ages",0,1,null,"Type selected",1]
[]
[null,null,null,null,null,null,null,false]
[null,null,null,null,null,null,null,null,null,null,null,null,null,null,"NEW BUSINESS DISCOUNT (ENTRADA MANUAL)"]
[null,null,null,null,null,null,null,null,null,null,null,null,null,null,"Essential"]
[null,null,null,null,null,null,null,null,null,null,null,null,null,null,0,0,0,0,0]
[]
[]
[]
[]
[]
[null,null,null,null,null,null,null,null,null,null,null,null,null,null,"Descuento de 24 años:",{"$f":"IF(P2,_xlfn.SWITCH(C43,O13,Q13,O14,Q14,O15,Q15,O16,Q16,O17,Q17,O18,Q18,Q19),Q19)","v":1}]
[]
[null,null,null,null,null,null,null,null,null,null,null,null,null,null,"Descuento por variante de coaseguro",{"$f":"IF(P3=TRUE,0.25,1)","v":1}]
[]
[]
[null,null,null,null,null,null,null,null,null,null,null,null,null,null,"Descuento si es nuevo negocio:"]
[]
["Nombre del Asegurado Titular:",null,"John Doe",null,null,null,null,null,null,null,null,null,null,null,"NEW BUSINESS DISCOUNT (MULTIPLICATION FACTOR)"]
[null,null,null,null,null,null,null,null,null,null,null,null,null,null,"Essential"]
["Número de adultos en la póliza:",null,2,null,null,null,null,null,null,null,null,null,null,null,{"$f":"IF($T$19=1,(O24/100),0)","v":0},{"$f":"IF($T$19=1,(P24/100),0)","v":0},{"$f":"IF($T$19=1,(Q24/100),0)","v":0},{"$f":"IF($T$19=1,(R24/100),0)","v":0},{"$f":"IF($T$19=1,(S24/100),0)","v":0}]
[]
{"$rows_left_out":8}
{"sheet":"BUPA ESSENTIAL CARE","index":1,"n_rows":79,"n_cols":26,"rows_kept":79,"cut":false,"hidden":false,"merged":[[73,0,73,1],[22,0,22,2],[78,0,81,7],[65,0,65,7],[66,0,66,1],[67,0,67,1],[68,0,68,1],[72,0,72,1],[39,0,39,7],[40,0,40,1],[41,0,41,1],[42,0,42,1],[45,0,45,1],[30,0,30,1],[31,0,31,1],[34,0,34,1],[35,0,35,1],[36,0,36,1],[0,0,3,7],[4,0,10,7],[12,1,12,7],[18,5,18,6],[16,2,16,3],[69,0,69,1],[71,0,71,1],[44,0,44,1],[57,0,57,1],[70,0,70,1],[56,0,56,1],[58,0,58,1],[46,0,46,1],[47,0,47,1],[52,0,52,7],[53,0,53,1],[54,0,54,1],[55,0,55,1],[59,0,59,1],[60,0,60,1],[0,10,0,23],[0,25,0,38],[23,28,23,29],[23,13,23,14],[33,0,33,1],[20,1,20,2],[25,0,25,1],[26,0,26,1],[28,0,28,7],[29,0,29,1]]}
[" ",null,null,null,null,null,null,null,null,null,"RESUMEN DE BENEFICIOS",null,null,null,null,null,null,null,null,null,null,null,null,null,null,"RESUMEN DE BENEFICIOS"]
[]
[]
[]
["Cotización de Seguro Médico Internacional\nBupa Essential Care\nTarifas en US$ | Validas: 1 de enero de 2024"]
[]
[]
[]
[]
[]
[]
[]
["Nombre del Asegurado Titular",{"$f":"+'INGRESO DE DATOS'!$C$37","v":"John Doe"}]
[]
["Número de adultos en la póliza",{"$f":"+'INGRESO DE DATOS'!$C$39","v":2}]
[]
["Número de Dependientes en la póliza",{"$f":"+'INGRESO DE DATOS'!$C$41","v":2},{"$f":"IF('INGRESO DE DATOS'!$P$2=TRUE, \"Cotización para dependiente de 24 años\",\"\")","v":""}]
[]
["Edad del Asegurado Titular",{"$f":"+'INGRESO DE DATOS'!$C$43","v":32},null,null,null,"Edad del/la conyuge",null,{"$f":"+'INGRESO DE DATOS'!$C$45","v":46}]
[]
["Fecha de la cotización",{"$f":"NOW()","v":"2024-01-10T13:30:10.240"}]
[]
[{"$f":"IF('INGRESO DE DATOS'!P3=TRUE,\"Variante con coaseguro fuera del país de residencia: SI\",\"Variante con coaseguro fuera del país de residencia: NO\")","v":"Variante con coaseguro fuera del país de residencia: NO"}]
[null,null," ",null,null,null,null," "]
["Deducibles",null,"PLAN 1","PLAN 2","PLAN 3","PLAN 4","PLAN 5","PLAN 6"]
["En el país de residencia",null,500,1000,1000,1000,10000,20000]
["Fuera del país de residencia",null,2000,5000,10000,20000,10000,20000]
[]
["TARIFAS ANUALES"]
["Prima para Asegurado Titular",null,{"$f":"VLOOKUP($B$19,Tablas!$A$10:$H$76,3,TRUE)","v":2234},{"$f":"VLOOKUP($B$19,Tablas!$A$10:$H$76,4,TRUE)","v":1993},{"$f":"VLOOKUP($B$19,Tablas!$A$10:$H$76,5,TRUE)","v":1813},{"$f":"VLOOKUP($B$19,Tablas!$A$10:$H$76,6,TRUE)","v":1622},{"$f":"VLOOKUP($B$19,Tablas!$A$10:$H$76,7,TRUE)","v":1496},{"$f":"VLOOKUP($B$19,Tablas!$A$10:$H$76,8,TRUE)","v":1182}]
["Prima para conyuge",null,{"$f":"IF($B$15=1,0,(VLOOKUP($H$19,Tablas!$A$10:$H$76,3,TRUE)))","v":3169},{"$f":"IF($B$15=1,0,(VLOOKUP($H$19,Tablas!$A$10:$H$76,4,TRUE)))","v":2829},{"$f":"IF($B$15=1,0,(VLOOKUP($H$19,Tablas!$A$10:$H$76,5,TRUE)))","v":2572},{"$f":"IF($B$15=1,0,(VLOOKUP($H$19,Tablas!$A$10:$H$76,6,TRUE)))","v":2301},{"$f":"IF($B$15=1,0,(VLOOKUP($H$19,Tablas!$A$10:$H$76,7,TRUE)))","v":2123},{"$f":"IF($B$15=1,0,(VLOOKUP($H$19,Tablas!$A$10:$H$76,8,TRUE)))","v":1676}]
["Prima para hijo (s)",null,{"$f":"IF($B$17=0,0,(VLOOKUP($B$17,Tablas!$A$77:$H$79,3,TRUE)))","v":1265},{"$f":"IF($B$17=0,0,(VLOOKUP($B$17,Tablas!$A$77:$H$79,4,TRUE)))","v":1129},{"$f":"IF($B$17=0,0,(VLOOKUP($B$17,Tablas!$A$77:$H$79,5,TRUE)))","v":1026},{"$f":"IF($B$17=0,0,(VLOOKUP($B$17,Tablas!$A$77:$H$79,6,TRUE)))","v":918},{"$f":"IF($B$17=0,0,(VLOOKUP($B$17,Tablas!$A$77:$H$79,7,TRUE)))","v":848},{"$f":"IF($B$17=0,0,(VLOOKUP($B$17,Tablas!$A$77:$H$79,8,TRUE)))","v":669}]
["Total de Prima neta",null,{"$f":"SUM(C30:C32)","v":6668},{"$f":"SUM(D30:D32)","v":5951},5411,{"$f":"SUM(F30:F32)","v":4841},{"$f":"SUM(G30:G32)","v":4467},3527]
["Ajuste por la variante con coaseguro fuera\n del país de residencia",null,{"$f":"IF('INGRESO DE DATOS'!$P$3,C33*-15%,0)","v":0},{"$f":"IF('INGRESO DE DATOS'!$P$3,D33*-15%,0)","v":0},{"$f":"IF('INGRESO DE DATOS'!$P$3,E33*-15%,0)","v":0},{"$f":"IF('INGRESO DE DATOS'!$P$3,F33*-15%,0)","v":0}]
["Tarifa administrativa anual",null,75,75,75,75,75,75]
["VAT (5%) :",null,{"$f":"(C33+C34)*5%","v":333.40000000000003},{"$f":"(D33+D34)*5%","v":297.55},270.55,{"$f":"(F33+F34)*5%","v":242.05},{"$f":"(G33+G34)*5%","v":223.35000000000002},{"$f":"(H33+H34)*5%","v":176.35000000000002}]
["ITBMS (7%)",null,{"$f":"+C35*7%","v":5.2500000000000009},{"$f":"+D35*7%","v":5.2500000000000009},5.2500000000000009,{"$f":"+F35*7%","v":5.2500000000000009},{"$f":"+G35*7%","v":5.2500000000000009},5.2500000000000009]
["TOTAL ANUAL",null,{"$f":"SUM(C33:C37)","v":7081.65},{"$f":"SUM(D33:D37)","v":6328.8},5761.8,{"$f":"SUM(F33:F37)","v":5163.3},4770.6000000000004,3783.6]
[]
["TARIFAS SEMESTRALES"]
{"$rows_left_out":40}
{"sheet":"RESUMEN DE TARIFAS","index":2,"n_rows":42,"n_cols":7,"rows_kept":42,"cut":false,"hidden":false,"merged":[[0,0,3,5],[20,1,20,2],[41,0,42,6],[28,1,28,6],[26,1,26,6],[32,1,32,6],[36,1,36,6],[22,0,22,6],[12,1,12,6],[4,0,10,6],[16,2,16,3]]}
[" "]
[]
[]
[]
["Cotización de Seguro Médico Internacional\nBupa Essential Care\nResumen de Tarifas\nTarifas en US$ | Validas: 1 de enero de 2024"]
[]
[]
[]
[]
[]
[]
[]
["Nombre del Asegurado Titular",{"$f":"+'INGRESO DE DATOS'!$C$37","v":"John Doe"}]
[]
["Número de adultos en la póliza",{"$f":"+'INGRESO DE DATOS'!$C$39","v":2}]
[]
["Número de Dependientes en la póliza",{"$f":"+'INGRESO DE DATOS'!$C$41","v":2},{"$f":"IF('INGRESO DE DATOS'!$P$2=TRUE, \"Cotización para dependiente de 24 años\",\"\")","v":""}]
[]
["Edad del Asegurado Titular",{"$f":"+'INGRESO DE DATOS'!$C$43","v":32},null,null,"Edad del/la conyuge",{"$f":"+'INGRESO DE DATOS'!$C$45","v":46}]
[]
["Fecha de la cotización",{"$f":"NOW()","v":"2024-01-10T13:30:10.240"}]
[]
["BUPA ESSENTIAL CARE"]
["DEDUCIBLES","PLAN 1","PLAN 2","PLAN 3","PLAN 4","PLAN 5","PLAN 5"]
["En el país de residencia",250,1000,1000,1000,10000,20000]
["Fuera del país de residencia",2000,5000,10000,20000,10000,20000]
[null,"TARIFAS ANUALES"]
[null,{"$f":"'BUPA ESSENTIAL CARE'!C38","v":7081.65},{"$f":"'BUPA ESSENTIAL CARE'!D38","v":6328.8},{"$f":"'BUPA ESSENTIAL CARE'!E38","v":5761.8},{"$f":"'BUPA ESSENTIAL CARE'!F38","v":5163.3},{"$f":"'BUPA ESSENTIAL CARE'!G38","v":4770.6000000000004},{"$f":"'BUPA ESSENTIAL CARE'!H38","v":3783.6}]
[null,"TARIFAS SEMESTRALES"]
[null,{"$f":"'BUPA ESSENTIAL CARE'!C49","v":3794.9928},{"$f":"'BUPA ESSENTIAL CARE'!D49","v":3395.5520999999999},{"$f":"'BUPA ESSENTIAL CARE'!E49","v":3094.7181},{"$f":"'BUPA ESSENTIAL CARE'!F49","v":2777.1711},{"$f":"'BUPA ESSENTIAL CARE'!G49","v":2568.8157000000006},{"$f":"'BUPA ESSENTIAL CARE'!H49","v":2045.1417000000001}]
[null,{"$f":"'BUPA ESSENTIAL CARE'!C50","v":3714.7428},{"$f":"'BUPA ESSENTIAL CARE'!D50","v":3315.3020999999999},{"$f":"'BUPA ESSENTIAL CARE'!E50","v":3014.4681},{"$f":"'BUPA ESSENTIAL CARE'!F50","v":2696.9211},{"$f":"'BUPA ESSENTIAL CARE'!G50","v":2488.5657000000006},{"$f":"'BUPA ESSENTIAL CARE'!H50","v":1964.8917000000001}]
[null,{"$f":"'BUPA ESSENTIAL CARE'!C51","v":7509.7356},{"$f":"'BUPA ESSENTIAL CARE'!D51","v":6710.8541999999998},{"$f":"'BUPA ESSENTIAL CARE'!E51","v":6109.1862000000001},{"$f":"'BUPA ESSENTIAL CARE'!F51","v":5474.0922},{"$f":"'BUPA ESSENTIAL CARE'!G51","v":5057.3814000000011},{"$f":"'BUPA ESSENTIAL CARE'!H51","v":4010.0334000000003}]
[null,"TARIFAS TRIMESTRALES"]
[null,{"$f":"'BUPA ESSENTIAL CARE'!C62","v":2008.9690000000001},{"$f":"'BUPA ESSENTIAL CARE'!D62","v":1801.5767500000002},{"$f":"'BUPA ESSENTIAL CARE'!E62","v":1645.3817500000002},{"$f":"'BUPA ESSENTIAL CARE'!F62","v":1480.5092500000001},{"$f":"'BUPA ESSENTIAL CARE'!G62","v":1372.3297500000003},{"$f":"'BUPA ESSENTIAL CARE'!H62","v":1100.4347500000003}]
[null,{"$f":"'BUPA ESSENTIAL CARE'!C63","v":1928.7190000000001},{"$f":"'BUPA ESSENTIAL CARE'!D63","v":1721.3267500000002},{"$f":"'BUPA ESSENTIAL CARE'!E63","v":1565.1317500000002},{"$f":"'BUPA ESSENTIAL CARE'!F63","v":1400.2592500000001},{"$f":"'BUPA ESSENTIAL CARE'!G63","v":1292.0797500000003},{"$f":"'BUPA ESSENTIAL CARE'!H63","v":1020.18475}]
[null,{"$f":"'BUPA ESSENTIAL CARE'!C64","v":7795.1260000000002},{"$f":"'BUPA ESSENTIAL CARE'!D64","v":6965.5570000000007},{"$f":"'BUPA ESSENTIAL CARE'!E64","v":6340.777000000001},{"$f":"'BUPA ESSENTIAL CARE'!F64","v":5681.2870000000003},{"$f":"'BUPA ESSENTIAL CARE'!G64","v":5248.5690000000013},{"$f":"'BUPA ESSENTIAL CARE'!H64","v":4160.9890000000005}]
[null,"TARIFAS MENSUALES"]
[null,{"$f":"'BUPA ESSENTIAL CARE'!C75","v":735.0476000000001},{"$f":"'BUPA ESSENTIAL CARE'!D75","v":664.6382000000001},{"$f":"'BUPA ESSENTIAL CARE'!E75","v":611.61019999999996},{"$f":"'BUPA ESSENTIAL CARE'!F75","v":555.63620000000003},{"$f":"'BUPA ESSENTIAL CARE'!G75","v":518.90940000000001},{"$f":"'BUPA ESSENTIAL CARE'!H75","v":426.60140000000001}]
[null,{"$f":"'BUPA ESSENTIAL CARE'!C76","v":654.7976000000001},{"$f":"'BUPA ESSENTIAL CARE'!D76","v":584.3882000000001},{"$f":"'BUPA ESSENTIAL CARE'!E76","v":531.36019999999996},{"$f":"'BUPA ESSENTIAL CARE'!F76","v":475.38620000000003},{"$f":"'BUPA ESSENTIAL CARE'!G76","v":438.65939999999995},{"$f":"'BUPA ESSENTIAL CARE'!H76","v":346.35140000000001}]
[null,{"$f":"'BUPA ESSENTIAL CARE'!C77","v":7937.8212000000012},{"$f":"'BUPA ESSENTIAL CARE'!D77","v":7092.9084000000012},{"$f":"'BUPA ESSENTIAL CARE'!E77","v":6456.5724},{"$f":"'BUPA ESSENTIAL CARE'!F77","v":5784.8843999999999},{"$f":"'BUPA ESSENTIAL CARE'!G77","v":5344.1628000000001},{"$f":"'BUPA ESSENTIAL CARE'!H77","v":4236.4668000000001}]
{"$rows_left_out":3}
{"sheet":"Tablas","index":3,"n_rows":302,"n_cols":23,"rows_kept":302,"cut":false,"hidden":true,"merged":[[8,17,8,22],[1,0,1,6],[2,0,2,6],[4,0,4,1],[3,2,3,6],[7,2,7,6],[1,20,1,22],[5,0,5,7],[6,0,6,7],[8,9,8,14],[231,0,231,1],[8,0,8,1],[2,12,2,13],[3,12,3,13],[1,8,1,9],[155,0,155,7],[230,0,230,7],[82,0,82,1],[81,0,81,7],[156,0,156,1]]}
[]
[null,null,null,null,null,null,null,null,"FACTOR MENSUAL:",null,9.3333333333333338E-2,null,"Descuento de 24 años",{"$f":"'INGRESO DE DATOS'!P30","v":1},"Essential"]
[null,null,null,null,null,null,null,null,"FACTOR TRIMESTRAL:",null,0.27500000000000002,null,"Descuento de producto (%)",null,{"$f":"'INGRESO DE DATOS'!O39","v":0}]
[null,null,null,null,null,null,null,null,"FACTOR SEMIANUAL:",null,0.53,null,"Factor para el descuento combinado",null,{"$f":"'INGRESO DE DATOS'!O47","v":1}]
[]
["BUPA ESSENTIAL CARE"]
["TARIFAS ANUALES"]
[]
["EDAD",null,500,1000,1000,1000,10000,20000,null,"TARIFAS BASE",null,null,null,null,null,null,null,"TARIFAS BASE CON DESCUENTO"]
[18,null,{"$f":"R10","v":1662},1483,1348,1207,1113,879,null,1662,1483,1348,1207,1113,879,null,null,{"$f":"J10*$O$4","v":1662},{"$f":"K10*$O$4","v":1483},1348,1207,{"$f":"N10*$O$4","v":1113},{"$f":"O10*$O$4","v":879}]
[19,null,{"$f":"R11","v":1689},{"$f":"S11","v":1507},{"$f":"T11","v":1370},{"$f":"U11","v":1226},{"$f":"V11","v":1131},{"$f":"W11","v":893},null,1689,1507,1370,1226,1131,893,null,null,{"$f":"J11*$O$4","v":1689},{"$f":"K11*$O$4","v":1507},{"$f":"L11*$O$4","v":1370},{"$f":"M11*$O$4","v":1226},{"$f":"N11*$O$4","v":1131},{"$f":"O11*$O$4","v":893}]
[20,null,1715,1531,1392,1246,1150,907,null,1715,1531,1392,1246,1150,907,null,null,1715,1531,1392,1246,1150,907]
[21,null,1742,1555,1414,1265,1167,922,null,1742,1555,1414,1265,1167,922,null,null,1742,1555,1414,1265,1167,922]
[22,null,1768,1578,1436,1285,1185,936,null,1768,1578,1436,1285,1185,936,null,null,1768,1578,1436,1285,1185,936]
[23,null,1796,1602,1457,1304,1203,950,null,1796,1602,1457,1304,1203,950,null,null,1796,1602,1457,1304,1203,950]
[24,null,1822,1626,1479,1323,1221,963,null,1822,1626,1479,1323,1221,963,null,null,1822,1626,1479,1323,1221,963]
[25,null,1849,1651,1501,1343,1238,977,null,1849,1651,1501,1343,1238,977,null,null,1849,1651,1501,1343,1238,977]
[26,null,1908,1703,1548,1385,1278,1008,null,1908,1703,1548,1385,1278,1008,null,null,1908,1703,1548,1385,1278,1008]
[27,null,1966,1754,1596,1427,1318,1039,null,1966,1754,1596,1427,1318,1039,null,null,1966,1754,1596,1427,1318,1039]
[28,null,2025,1807,1643,1470,1356,1070,null,2025,1807,1643,1470,1356,1070,null,null,2025,1807,1643,1470,1356,1070]
[29,null,2083,1859,1691,1512,1396,1102,null,2083,1859,1691,1512,1396,1102,null,null,2083,1859,1691,1512,1396,1102]
[30,null,2141,1911,1738,1555,1435,1133,null,2141,1911,1738,1555,1435,1133,null,null,2141,1911,1738,1555,1435,1133]
[31,null,2188,1952,1775,1588,1466,1157,null,2188,1952,1775,1588,1466,1157,null,null,2188,1952,1775,1588,1466,1157]
[32,null,2234,1993,1813,1622,1496,1182,null,2234,1993,1813,1622,1496,1182,null,null,2234,1993,1813,1622,1496,1182]
[33,null,2280,2034,1851,1655,1527,1205,null,2280,2034,1851,1655,1527,1205,null,null,2280,2034,1851,1655,1527,1205]
[34,null,2325,2075,1887,1689,1558,1230,null,2325,2075,1887,1689,1558,1230,null,null,2325,2075,1887,1689,1558,1230]
[35,null,2371,2116,1925,1722,1589,1255,null,2371,2116,1925,1722,1589,1255,null,null,2371,2116,1925,1722,1589,1255]
[36,null,2433,2171,1975,1766,1630,1287,null,2433,2171,1975,1766,1630,1287,null,null,2433,2171,1975,1766,1630,1287]
[37,null,2494,2226,2024,1811,1672,1319,null,2494,2226,2024,1811,1672,1319,null,null,2494,2226,2024,1811,1672,1319]
[38,null,2557,2281,2074,1856,1712,1352,null,2557,2281,2074,1856,1712,1352,null,null,2557,2281,2074,1856,1712,1352]
[39,null,2618,2337,2124,1900,1754,1384,null,2618,2337,2124,1900,1754,1384,null,null,2618,2337,2124,1900,1754,1384]
[40,null,2679,2391,2175,1944,1795,1416,null,2679,2391,2175,1944,1795,1416,null,null,2679,2391,2175,1944,1795,1416]
[41,null,2765,2468,2244,2007,1853,1462,null,2765,2468,2244,2007,1853,1462,null,null,2765,2468,2244,2007,1853,1462]
[42,null,2852,2545,2314,2070,1910,1508,null,2852,2545,2314,2070,1910,1508,null,null,2852,2545,2314,2070,1910,1508]
[43,null,2938,2622,2384,2132,1968,1553,null,2938,2622,2384,2132,1968,1553,null,null,2938,2622,2384,2132,1968,1553]
[44,null,3024,2698,2454,2195,2026,1599,null,3024,2698,2454,2195,2026,1599,null,null,3024,2698,2454,2195,2026,1599]
[45,null,3110,2776,2524,2258,2084,1645,null,3110,2776,2524,2258,2084,1645,null,null,3110,2776,2524,2258,2084,1645]
[46,null,3169,2829,2572,2301,2123,1676,null,3169,2829,2572,2301,2123,1676,null,null,3169,2829,2572,2301,2123,1676]
[47,null,3229,2882,2621,2344,2163,1707,null,3229,2882,2621,2344,2163,1707,null,null,3229,2882,2621,2344,2163,1707]
[48,null,3289,2935,2669,2387,2204,1739,null,3289,2935,2669,2387,2204,1739,null,null,3289,2935,2669,2387,2204,1739]
{"$rows_left_out":262}