{"text_format":"1","workbook":"xlsx","n_sheets":8,"sheets":["INGRESO DE DATOS","Privilege Care International","Advantage (LA)","Secure Care International","Resumen tarifas anuales","Comparacion de Beneficios","Tablas","Venezuela"],"not_rendered":{"charts":0,"images":6,"macros":1,"external_links":0,"defined_names":3,"comments":1,"pivot_tables":0},"unopened":[],"bounds":{"document_bytes":16777216,"sheet_cells":100000,"rows_first":2000,"rows_last":500,"rows_between":2000,"halvings":0,"cell_chars":16384,"cell_head_chars":4096},"cells_cut":0,"cells_raw":0,"read":"whole","date_system":"1900"}

{"sheet":"INGRESO DE DATOS","index":0,"n_rows":63,"n_cols":23,"rows_kept":63,"cut":false,"hidden":false,"merged":[[62,14,62,15],[61,14,61,15],[47,14,47,15],[29,14,29,17],[36,14,36,19],[55,14,55,15],[56,14,56,15],[58,14,58,15],[59,14,59,15],[3,14,3,16],[46,2,46,11],[35,2,35,11],[35,0,35,1],[37,0,37,1],[39,0,39,1],[41,0,41,1],[43,0,43,1],[16,14,16,19],[31,14,31,19],[39,14,39,19],[4,18,11,18],[46,0,46,1],[7,0,7,9],[4,21,11,21],[49,14,49,15],[50,14,50,15],[53,14,53,15],[52,14,52,15]]}
[]
[null,null,null,null,null,null,null,null," "," "," ",null,null,null,"24 years",true]
[]
[null,null,null,null,null,null,null,null,null,null,null,null,null,null,"Descuento 24 años (por edad)"]
[null,null,null,null,null,null,null,null,null,null,null,null,null,null,"age","Discount (%)","Parameter",null,"Type","Nuevo Negocio",null,"Región",2]
[null,null,null,null,null,null,null,null," "," "," "," ",null,null,24,35,{"$f":"1-P6/100","v":0.65},null,null,"Renovación",null,null,3]
[null,null,null,null,null,null,null,null,null,null,null,null,null,null,25,30,{"$f":"1-P7/100","v":0.7},null,null,null,null,null,4]
[null,null,null,null,null,null,null,null,null,null,null,null,null,null,26,25,0.75,null,null,null,null,null,5]
[null,null,null,null,null,null,null,null,null,null,null,null,null,null,27,20,0.8,null,null,null,null,null,6]
[null,null,null,null,null,null,null,null,null,null,null,null,null,null,28,15,0.85,null,null,null,null,null,8]
[null,null,null,null,null,null,null,null,null,null,null,null,null,null,29,6,0.94,null,null,null,null,null,9]
[null,null,null,null,null,null,null,null,null,null,null,null,null,null,"All ages",0,1,null,null,null,null,null,"Venezuela"]
[null,null,null,null,null,null,null,null,null,null,null,null,null,null,null,null,null,null,"Type selected",2,null,"Selección",8]
[null,null,null,null,null,null,null,null,null,null,null,null,null,null,null,null,null,null,null,null,null,"Región",{"$f":"IF(W13=1,2,IF(W13=2,3,IF(W13=3,4,IF(W13=4,5,IF(W13=4,5,IF(W13=5,6,IF(W13=6,8,IF(W13=7,9,IF(W13=8,\"VENEZUELA\")))))))))","v":"VENEZUELA"}]
[]
[]
[]
[]
[null,null,null,null,null,null,null,null,null,null,null,null,null,null,"Descuento de 24 años:",{"$f":"IF(P2,_xlfn.SWITCH(C42,O6,Q6,O7,Q7,O8,Q8,O9,Q9,O10,Q10,O11,Q11,Q12),Q12)","v":0.65}]
[]
[]
[]
[]
[null,null,null,null,null,null,null,null,null,null,null,null,null,null,"Descuento por variante de coaseguro","N/A"]
[]
[]
[]
[]
[]
[null,null,null,null,null,null,null,null,null,null,null,null,null,null,"Descuento si es nuevo negocio (ENTRADA MANUAL)"]
[]
[null,null,null,null,null,null,null,null,null,null,null,null,null,null,"New business discount"]
[null,null,null,null,null,null,null,null,null,null,null,null,null,null,"Critical","Exclusive","Privilege","Advantage","Secure","Essential"]
[]
[]
["Nombre del Asegurado principal:",null,"John Doe"]
[null,null,null,null,null,null,null,null,null,null,null,null,null,null,"Descuento combinado 24 años + Nuevo Negocio o Roneovaciones"]
["Número de adultos en la póliza: ",null,1]
[]
["Número de hijos en la póliza:",null,0,null,null,null,null,null,null,null,null,null,null,null,"New business discount"]
[null,null,null,null,null,null,null,null,null,null,null,null,null,null,"Critical","Exclusive","Privilege","Advantage","Secure","Essential"]
[" Edad del titular:",null,24,null,null,null,null,null,null,null,null,null,null,null,{"$f":"1*$P$19","v":0.65},{"$f":"IF($T$13=1,IF($W$14=\"PERU2020\", (1-O51)*$P$19,(1-P34)*$P$19),1*$P$19)","v":0.65},{"$f":"IF($T$13=1,IF($W$14=\"PERU2020\", (1-O54)*$P$19,(1-Q34)*$P$19),1*$P$19)","v":0.65},{"$f":"IF($T$13=1,IF($W$14=\"PERU2020\", (1-O57)*$P$19,(1-R34)*$P$19),1*$P$19)","v":0.65},{"$f":"IF($T$13=1,IF($W$14=\"PERU2020\", (1-O60)*$P$19,(1-S34)*$P$19),1*$P$19)","v":0.65},{"$f":"IF($T$13=1,IF($W$14=\"PERU2020\", (1-O63)*$P$19,(1-T34)*$P$19),1*$P$19)","v":0.65}]
[]
["Edad de cónyuge:",null,55]
[]
[]
["Nombre de la Agencia :",null,"Agencia"]
[null,null,null,null,null,null,null,null,null,null,null,null,null,null,"DISCOUNT PERU 2020"]
[]
[null,null,null,null,null,null,null,null,null,null,null,null,null,null,"EXCLUSIVE CARE"]
[null,null,null,null,null,null,null,null,null,null,null,null,null,null,0.51]
[]
[null,null,null,null,null,null,null,null,null,null,null,null,null,null,"PRIVILEGE CARE"]
[null,null,null,null,null,null,null,null,null,null,null,null,null,null,0.51]
[]
[null,null,null,null,null,null,null,null,null,null,null,null,null,null,"ADVANTAGE CARE"]
[null,null,null,null,null,null,null,null,null,null,null,null,null,null,0.47]
[]
[null,null,null,null,null,null,null,null,null,null,null,null,null,null,"SECURE CARE"]
[null,null,null,null,null,null,null,null,null,null,null,null,null,null,0.54]
[]
[null,null,null,null,null,null,null,null,null,null,null,null,null,null,"ESSENTIAL CARE"]
[null,null,null,null,null,null,null,null,null,null,null,null,null,null,0.54]

{"sheet":"Privilege Care International","index":1,"n_rows":55,"n_cols":27,"rows_kept":55,"cut":false,"hidden":false,"merged":[[20,5,21,5],[16,7,16,8],[18,7,18,8],[20,7,21,8],[20,9,21,9],[17,7,17,8],[53,0,53,1],[53,2,53,3],[52,0,52,1],[52,2,52,3],[52,5,56,9],[25,0,25,1],[26,0,26,1],[24,2,24,3],[32,0,32,1],[29,0,29,1],[31,2,31,3],[27,0,27,1],[28,0,28,1],[30,0,31,1],[24,0,24,1],[49,5,49,10],[30,2,30,3],[33,2,33,3],[47,2,49,3],[32,2,32,3],[34,2,34,3],[46,2,46,3],[35,2,35,3],[43,2,43,3],[36,2,36,3],[41,2,41,3],[38,2,38,3],[39,2,39,3],[44,2,44,3],[45,2,45,3],[40,2,40,3],[47,0,49,1],[33,0,33,1],[34,0,34,1],[38,0,38,1],[39,0,39,1],[46,0,46,1],[40,0,40,1],[41,0,41,1],[42,0,42,1],[36,0,36,1],[35,0,35,1],[44,0,44,1],[45,0,45,1],[43,0,43,1],[42,2,42,3],[0,12,0,24],[0,26,0,38],[22,15,22,16],[22,29,22,30],[12,6,12,9],[29,2,29,3],[27,2,27,3],[28,2,28,3],[26,2,26,3],[25,2,25,3],[4,9,5,9],[6,9,10,9],[4,5,10,8],[29,5,29,10],[39,5,39,10],[45,17,45,24],[45,31,45,38],[47,17,48,24],[47,31,48,38],[14,6,14,9]]}
[null,null,null,null,null,null,null,null,null,null,null,null,"RESUMEN DE BENEFICIOS",null,null,null,null,null,null,null,null,null,null,null,null,null,"RESUMEN DE BENEFICIOS"]
[null,null,null,null,null,null,false,null," "," "," "]
[]
[]
[null,null,null,null,null,"Cotización de Seguro Médico Internacional\nBupa Privilege Care International\nTarifas en US$ | Validas: 1 de enero de 2024",null,null,null,"REGIÓN"]
[]
[null,null,null,null,null,null,null,null,null,{"$f":"IF('INGRESO DE DATOS'!W14=\"PERU2020\",\"Perú\",'INGRESO DE DATOS'!W14)","v":"VENEZUELA"}]
[]
[]
[]
[]
[]
[null,null,null,null,null,"Nombre del asegurado principal",{"$f":"+'INGRESO DE DATOS'!$C$36","v":"John Doe"}]
[]
[null,null,null,null,null,"Broker/Agente",{"$f":"+'INGRESO DE DATOS'!$C$47","v":"Agencia"}]
[]
[null,null,null,null,null,"Número de Adultos en la Póliza",{"$f":"+'INGRESO DE DATOS'!$C$38","v":1},"Dependientes (menores de 24 años)",null,{"$f":"+'INGRESO DE DATOS'!$C$40","v":0}]
[null,null,null,null,null,null,null,{"$f":"IF('INGRESO DE DATOS'!$P$2=TRUE, \"Cotización para dependiente de 24 años\",\"\")","v":"Cotización para dependiente de 24 años"}]
[null,null,null,null,null,"Edad del Titular",{"$f":"+'INGRESO DE DATOS'!$C$42","v":24},"Edad del Cónyuge",null,{"$f":"+'INGRESO DE DATOS'!$C$44","v":55}]
[]
[null,null,null,null,null,null,null," Fecha de Cotización:",null,{"$f":"NOW()","v":"2023-12-27T16:02:06.490"}]
[]
[]
[]
[null,null,null,null,null,"DEDUCIBLES","PLAN 1","PLAN 2","PLAN 3","PLAN 4","PLAN 5"]
[null,null,null,null,null,"Dentro del pais de residencia","N/A","N/A","N/A","N/A",20000]
[null,null,null,null,null,"Fuera del pais de residencia",2000,5000,10000,20000,20000]
[]
[]
[null,null,null,null,null,"TARIFAS ANUALES"]
[null,null,null,null,null,"Prima de Titular",{"$f":"VLOOKUP($G$19,Tablas!$A$152:$H$175,4,TRUE)","v":2010.4},{"$f":"VLOOKUP($G$19,Tablas!$A$152:$H$175,5,TRUE)","v":1433.8500000000001},{"$f":"VLOOKUP($G$19,Tablas!$A$152:$H$175,6,TRUE)","v":1021.75},{"$f":"VLOOKUP($G$19,Tablas!$A$152:$H$175,7,TRUE)","v":780.6},{"$f":"VLOOKUP($G$19,Tablas!$A$152:$H$175,8,TRUE)","v":0}]
[null,null,null,null,null,"Prima de Cónyuge",{"$f":"IF($G$17=1,0,(VLOOKUP($J$19,Tablas!$A$152:$H$175,4,TRUE)))","v":0},{"$f":"IF($G$17=1,0,(VLOOKUP($J$19,Tablas!$A$152:$H$175,5,TRUE)))","v":0},{"$f":"IF($G$17=1,0,(VLOOKUP($J$19,Tablas!$A$152:$H$175,6,TRUE)))","v":0},{"$f":"IF($G$17=1,0,(VLOOKUP($J$19,Tablas!$A$152:$H$175,7,TRUE)))","v":0},{"$f":"IF($G$17=1,0,(VLOOKUP($J$19,Tablas!$A$152:$H$175,8,TRUE)))","v":0}]
[null,null,null,null,null,"Primas Hijos",{"$f":"IF($J$17=0,0,(VLOOKUP($J$17,Tablas!$A$176:$H$178,4,TRUE)))","v":0},{"$f":"IF($J$17=0,0,(VLOOKUP($J$17,Tablas!$A$176:$H$178,5,TRUE)))","v":0},{"$f":"IF($J$17=0,0,(VLOOKUP($J$17,Tablas!$A$176:$H$178,6,TRUE)))","v":0},{"$f":"IF($J$17=0,0,(VLOOKUP($J$17,Tablas!$A$176:$H$178,7,TRUE)))","v":0},{"$f":"IF($J$17=0,0,(VLOOKUP($J$17,Tablas!$A$176:$H$178,8,TRUE)))","v":0}]
[null,null,null,null,null,"Rider: Complicaciónes de Maternidad",{"$f":"+IF($G$2=FALSE,0,Tablas!D$179)","v":0},{"$f":"+IF($G$2=FALSE,0,Tablas!E$179)","v":0},{"$f":"+IF($G$2=FALSE,0,Tablas!F$179)","v":0},{"$f":"+IF($G$2=FALSE,0,Tablas!G$179)","v":0},{"$f":"+IF($G$2=FALSE,0,Tablas!H$179)","v":0}]
[null,null,null,null,null,"TOTAL PRIMA NETA",{"$f":"SUM(G31:G34)","v":2010.4},{"$f":"SUM(H31:H34)","v":1433.8500000000001},{"$f":"SUM(I31:I34)","v":1021.75},{"$f":"SUM(J31:J34)","v":780.6},{"$f":"SUM(K31:K34)","v":0}]
[null,null,null,null,null,"Costo Administrativo Anual",75,75,75,75,75]
[null,null,null,null,null,"GRAN TOTAL",{"$f":"SUM(G35:G36)","v":2085.4},{"$f":"SUM(H35:H36)","v":1508.8500000000001},{"$f":"SUM(I35:I36)","v":1096.75},{"$f":"SUM(J35:J36)","v":855.6},{"$f":"SUM(K35:K36)","v":75}]
[]
[]
[null,null,null,null,null,"TARIFAS SEMESTRALES"]
[null,null,null,null,null,"Prima de Titular",{"$f":"VLOOKUP($G$19,Tablas!$A$187:$H$210,4,TRUE)","v":1065.5120000000002},{"$f":"VLOOKUP($G$19,Tablas!$A$187:$H$210,5,TRUE)","v":759.94050000000016},{"$f":"VLOOKUP($G$19,Tablas!$A$187:$H$210,6,TRUE)","v":541.52750000000003},{"$f":"VLOOKUP($G$19,Tablas!$A$187:$H$210,7,TRUE)","v":413.71800000000002},{"$f":"VLOOKUP($G$19,Tablas!$A$187:$H$210,8,TRUE)","v":0}]
[null,null,null,null,null,"Prima de Cónyuge",{"$f":"IF($G$17=1,0,(VLOOKUP($J$19,Tablas!$A$187:$H$210,4,TRUE)))","v":0},{"$f":"IF($G$17=1,0,(VLOOKUP($J$19,Tablas!$A$187:$H$210,5,TRUE)))","v":0},{"$f":"IF($G$17=1,0,(VLOOKUP($J$19,Tablas!$A$187:$H$210,6,TRUE)))","v":0},{"$f":"IF($G$17=1,0,(VLOOKUP($J$19,Tablas!$A$187:$H$210,7,TRUE)))","v":0},{"$f":"IF($G$17=1,0,(VLOOKUP($J$19,Tablas!$A$187:$H$210,8,TRUE)))","v":0}]
[null,null,null,null,null,"Primas Hijos",{"$f":"IF($J$17=0,0,(VLOOKUP($J$17,Tablas!$A$211:$H$213,4,TRUE)))","v":0},{"$f":"IF($J$17=0,0,(VLOOKUP($J$17,Tablas!$A$211:$H$213,5,TRUE)))","v":0},{"$f":"IF($J$17=0,0,(VLOOKUP($J$17,Tablas!$A$211:$H$213,6,TRUE)))","v":0},{"$f":"IF($J$17=0,0,(VLOOKUP($J$17,Tablas!$A$211:$H$213,7,TRUE)))","v":0},{"$f":"IF($J$17=0,0,(VLOOKUP($J$17,Tablas!$A$211:$H$213,8,TRUE)))","v":0}]
[null,null,null,null,null,"Prima Rider Complic. Maternidad",{"$f":"+IF($G$2=FALSE,0,Tablas!D$214)","v":0},{"$f":"+IF($G$2=FALSE,0,Tablas!E$214)","v":0},{"$f":"+IF($G$2=FALSE,0,Tablas!F$214)","v":0},{"$f":"+IF($G$2=FALSE,0,Tablas!G$214)","v":0},{"$f":"+IF($G$2=FALSE,0,Tablas!H$214)","v":0}]
[null,null,null,null,null,"TOTAL PRIMA NETA",{"$f":"SUM(G41:G44)","v":1065.5120000000002},{"$f":"SUM(H41:H44)","v":759.94050000000016},{"$f":"SUM(I41:I44)","v":541.52750000000003},{"$f":"SUM(J41:J44)","v":413.71800000000002},{"$f":"SUM(K41:K44)","v":0}]
[null,null,null,null,null,"Costo Administrativo Anual",75,75,75,75,75]
[null,null,null,null,null,"TOTAL  (1ra Cuota) :",{"$f":"SUM(G45:G46)","v":1140.5120000000002},{"$f":"SUM(H45:H46)","v":834.94050000000016},{"$f":"SUM(I45:I46)","v":616.52750000000003},{"$f":"SUM(J45:J46)","v":488.71800000000002},{"$f":"SUM(K45:K46)","v":75}]
[null,null,null,null,null,"TOTAL  (2da Cuota) :",{"$f":"G45","v":1065.5120000000002},{"$f":"H45","v":759.94050000000016},541.52750000000003,413.71800000000002,0]
[null,null,null,null,null,"GRAN TOTAL",{"$f":"SUM(G47:G48)","v":2206.0240000000003},{"$f":"SUM(H47:H48)","v":1594.8810000000003},{"$f":"SUM(I47:I48)","v":1158.0550000000001},{"$f":"SUM(J47:J48)","v":902.43600000000004}]
[]
[]
[]
[null,null,null,null,null,"Este presupuesto solamente tiene carácter informativo y en ningún momento expresa compromiso legal para suministrarle cobertura de seguro. La emisión de una póliza de seguro Bupa está sujeta a todas las evaluaciones de riesgo por parte de Bupa y a la recepción de todos los pagos de prima requeridos."]
[]
[null," "]

{"sheet":"Advantage (LA)","index":2,"n_rows":50,"n_cols":13,"rows_kept":50,"cut":false,"hidden":true,"merged":[[45,0,46,1],[42,0,42,1],[41,2,41,3],[42,2,42,3],[43,0,43,1],[43,2,43,3],[44,0,44,1],[44,2,44,3],[39,0,39,1],[40,0,40,1],[39,2,39,3],[41,0,41,1],[40,2,40,3],[22,0,23,1],[24,0,24,1],[33,0,33,1],[34,0,34,1],[38,2,38,3],[38,0,38,1],[35,0,35,1],[35,2,35,3],[36,0,36,1],[36,2,36,3],[34,2,34,3],[19,0,19,1],[28,0,28,1],[28,2,28,3],[32,0,32,1],[25,2,25,3],[25,0,25,1],[26,0,26,1],[26,2,26,3],[32,2,32,3],[21,2,21,3],[22,2,22,3],[31,2,31,3],[27,0,27,1],[29,0,29,1],[30,0,31,1],[20,0,21,1],[49,5,49,12],[12,2,12,3],[13,2,13,3],[14,2,14,3],[15,2,15,3],[27,2,27,3],[16,2,16,3],[20,2,20,3],[17,2,18,3],[29,2,29,3],[30,2,30,3],[23,2,23,3],[24,2,24,3],[19,2,19,3],[33,2,33,3],[45,2,46,3],[9,0,9,12],[11,7,11,12],[13,7,13,12],[17,5,17,6],[16,5,16,6],[11,0,11,3],[17,0,18,1],[12,0,12,1],[13,0,13,1],[14,0,14,1],[15,0,15,1],[16,0,16,1]]}
[]
[null,null,null,null,null,null,null,null,null," "," "," "]
[]
[]
[]
[null,null,null,null,null,null,null,null,null," "," "," "," "]
[]
[]
[]
["Cotización de Seguro Médico Internacional - Bupa ADVANTAGE Care (cobertura solo Latinoamérica)"]
[]
["Bupa Advantage Care (cobertura solo en Latinoamérica)",null,null,null,null,null,null,{"$f":"+'INGRESO DE DATOS'!$C$36","v":"John Doe"}]
["Cobertura Máxima anual",null,"US $ 3,500,000"]
["Cobertura Geografica",null,"Limitada a Latinoamérica excluyendo México",null,null,null,null,{"$f":"+'INGRESO DE DATOS'!$C$47","v":"Agencia"}]
["Condiciones médicas cubiertas",null,"Todas las condiciones médicas"]
["Redes de proveedores",null,"Red de Proveedores \"Bupa Advantage\"",null,null,null,null,null,null,{"$f":"+'INGRESO DE DATOS'!$C$38","v":1},null,null,{"$f":"+'INGRESO DE DATOS'!$C$42","v":24}]
["Opciones fuera de la Red",null,"NO, solo en casos de emergencia",null,null,"FECHA DE COTIZACION :"]
["Requiere preautorización",null,"SI, 30% de penalización por omitir prenotificación",null,null,{"$f":"NOW()","v":"2023-12-27T16:02:06.490"},null,null,null,{"$f":"+'INGRESO DE DATOS'!$C$40","v":0},null,null,{"$f":"+'INGRESO DE DATOS'!$C$44","v":55}]
[null,null,null,null,null,null,null,null,null," "," "," "]
["Número máximo de días de hospitalización",null,"Ilimitado",null,null,null,null,null,true,null,"COMPLICACIONES DE MATERNIDAD"]
["Habitación y alimentación",null,"100% dentro de Red Bupa"]
[null,null,"\"UCR\" para L.A. en emergencias fuera de  Red Bupa",null,null,null,null,null,true,null,"TRASPLANTE DE ORGANOS"]
["Cuidados Intensivos",null,"100% dentro de Red Bupa"]
[null,null,"\"UCR\" para L.A. en emergencias fuera de  Red Bupa",null,null,null," "]
["Cobertura de Maternidad",null,"$5,000 (Excepto planes 4,5, y 6)",null,null,"Deducibles",null,"PLAN 1","PLAN 2","PLAN 3","PLAN 4","PLAN 5","PLAN 6"]
["Cobertura Provisional de Recién Nacido",null,"$30,000 por los primeros 90 días",null,null,"Dentro del pais de residencia",null,"n/a",1000,2000,5000,10000,20000]
["Cuidado del Recién Nacido saludable",null,"Ya incluída dentro del beneficio de Maternidad",null,null,"Fuera del pais de residencia",null,"n/a",2000,3000,5000,10000,20000]
["Cobertura de Complicaciones de Maternidad",null,"Disponible a través de cobertura opcional adicional"]
["Trasplante de Organos",null,"$1,000,000 de por vida, por diagnóstico"]
["Condiciones congénitas y hereditarias",null,"<18 años $300,000 de por vida; >=18 al 100%",null,null,"Tarifas Anuales"]
["Coberturas opcionales (Riders)",null,"Complicaciones de Maternidad por $500,000",null,null,"Prima de Titular :",null,"n/a",{"$f":"VLOOKUP($M$16,Tablas!$A$370:$H$393,4,TRUE)","v":11240},{"$f":"VLOOKUP($M$16,Tablas!$A$370:$H$393,5,TRUE)","v":8450},{"$f":"VLOOKUP($M$16,Tablas!$A$370:$H$393,6,TRUE)","v":6003},{"$f":"VLOOKUP($M$16,Tablas!$A$370:$H$393,7,TRUE)","v":4521},{"$f":"VLOOKUP($M$16,Tablas!$A$370:$H$393,8,TRUE)","v":3578}]
[null,null,"Trasplante de órganos por $ 300,000 adicionales",null,null,"Prima de Cónyuge",null,"n/a",{"$f":"IF($J$16=1,0,(VLOOKUP($M$18,Tablas!$A$370:$H$393,4,TRUE)))","v":0},{"$f":"IF($J$16=1,0,(VLOOKUP($M$18,Tablas!$A$370:$H$393,5,TRUE)))","v":0},{"$f":"IF($J$16=1,0,(VLOOKUP($M$18,Tablas!$A$370:$H$393,6,TRUE)))","v":0},{"$f":"IF($J$16=1,0,(VLOOKUP($M$18,Tablas!$A$370:$H$393,7,TRUE)))","v":0},{"$f":"IF($J$16=1,0,(VLOOKUP($M$18,Tablas!$A$370:$H$393,8,TRUE)))","v":0}]
["Acompañamiento de menores hospitalizados",null,"$300 por día",null,null,"Primas Hijos :",null,"n/a",{"$f":"IF($J$18=0,0,(VLOOKUP($J$18,Tablas!$A$394:$H$396,4,TRUE)))","v":0},{"$f":"IF($J$18=0,0,(VLOOKUP($J$18,Tablas!$A$394:$H$396,5,TRUE)))","v":0},{"$f":"IF($J$18=0,0,(VLOOKUP($J$18,Tablas!$A$394:$H$396,6,TRUE)))","v":0},{"$f":"IF($J$18=0,0,(VLOOKUP($J$18,Tablas!$A$394:$H$396,7,TRUE)))","v":0},{"$f":"IF($J$18=0,0,(VLOOKUP($J$18,Tablas!$A$394:$H$396,8,TRUE)))","v":0}]
["Ambulancia aérea",null,"$100,000 por año y ticket aéreo de retorno",null,null,"Prima Rider Complic. Maternidad",null,"n/a",{"$f":"+IF($I$20=FALSE,0,Tablas!D$397)","v":0},{"$f":"+IF($I$20=FALSE,0,Tablas!E$397)","v":0},{"$f":"+IF($I$20=FALSE,0,Tablas!F$397)","v":0},{"$f":"+IF($I$20=FALSE,0,Tablas!G$397)","v":0},{"$f":"+IF($I$20=FALSE,0,Tablas!H$397)","v":0}]
["Repatriación restos mortales",null,1,null,null,"Prima Rider Trasplante Organos",null,"n/a",{"$f":"IF($I$22=FALSE,0,Tablas!D$398)","v":0},{"$f":"IF($I$22=FALSE,0,Tablas!E$398)","v":0},{"$f":"IF($I$22=FALSE,0,Tablas!F$398)","v":0},{"$f":"IF($I$22=FALSE,0,Tablas!G$398)","v":0},{"$f":"IF($I$22=FALSE,0,Tablas!H$398)","v":0}]
["Medicamentos por receta",null,"$6,000 por Asegurado, por año póliza",null,null,"TOTAL PRIMA NETA :",null,"n/a",{"$f":"SUM(I31:I35)","v":11240},8450,6003,4521,3578]
["Almacenamiento de sangre de cordon umbilical",null,"$500  (Excepto planes 4,5, y 6)",null,null,"Costo Administrativo Anual :",null,"n/a",75,75,75,75,75]
[null,null,null,null,null,"GRAN TOTAL :",null,"n/a",{"$f":"SUM(I36:I37)","v":11315},{"$f":"SUM(J36:J37)","v":8525},{"$f":"SUM(K36:K37)","v":6078},{"$f":"SUM(L36:L37)","v":4596},{"$f":"SUM(M36:M37)","v":3653}]
["Atención médica en el hogar",null,"100% de usual/acostumbrado y razonable"]
["Rehabilitación",null,"100% de usual/acostumbrado y razonable",null,null,"Tarifas Semestrales"]
["Residencia y cuidados paliativos",null,"100% de usual/acostumbrado y razonable",null,null,"Prima de Titular :",null,"n/a",{"$f":"VLOOKUP($M$16,Tablas!$A$403:$H$426,4,TRUE)","v":5957.2000000000007},{"$f":"VLOOKUP($M$16,Tablas!$A$403:$H$426,5,TRUE)","v":4478.5},{"$f":"VLOOKUP($M$16,Tablas!$A$403:$H$426,6,TRUE)","v":3181.59},{"$f":"VLOOKUP($M$16,Tablas!$A$403:$H$426,7,TRUE)","v":2396.13},{"$f":"VLOOKUP($M$16,Tablas!$A$403:$H$426,8,TRUE)","v":1896.3400000000001}]
["Cobertura de actividades peligrosas",null,1,null,null,"Prima de Cónyuge",null,"n/a",{"$f":"IF($J$16=1,0,(VLOOKUP($M$18,Tablas!$A$403:$H$426,4,TRUE)))","v":0},{"$f":"IF($J$16=1,0,(VLOOKUP($M$18,Tablas!$A$403:$H$426,5,TRUE)))","v":0},{"$f":"IF($J$16=1,0,(VLOOKUP($M$18,Tablas!$A$403:$H$426,6,TRUE)))","v":0},{"$f":"IF($J$16=1,0,(VLOOKUP($M$18,Tablas!$A$403:$H$426,7,TRUE)))","v":0},{"$f":"IF($J$16=1,0,(VLOOKUP($M$18,Tablas!$A$403:$H$426,8,TRUE)))","v":0}]
["Chequeos generales de rutina",null,"Hasta US$150 por año póliza.Sin deducible",null,null,"Primas Hijos :",null,"n/a",{"$f":"IF($J$18=0,0,(VLOOKUP($J$18,Tablas!$A$427:$H$429,4,TRUE)))","v":0},{"$f":"IF($J$18=0,0,(VLOOKUP($J$18,Tablas!$A$427:$H$429,5,TRUE)))","v":0},{"$f":"IF($J$18=0,0,(VLOOKUP($J$18,Tablas!$A$427:$H$429,6,TRUE)))","v":0},{"$f":"IF($J$18=0,0,(VLOOKUP($J$18,Tablas!$A$427:$H$429,7,TRUE)))","v":0},{"$f":"IF($J$18=0,0,(VLOOKUP($J$18,Tablas!$A$427:$H$429,8,TRUE)))","v":0}]
["Cobertura de VIH, SIDA, CAS",null,"Solo como efecto de transfusión de sangre",null,null,"Prima Rider Complic. Maternidad",null,"n/a",{"$f":"+IF($I$20=FALSE,0,Tablas!D$430)","v":0},{"$f":"+IF($I$20=FALSE,0,Tablas!E$430)","v":0},{"$f":"+IF($I$20=FALSE,0,Tablas!F$430)","v":0},{"$f":"+IF($I$20=FALSE,0,Tablas!G$430)","v":0},{"$f":"+IF($I$20=FALSE,0,Tablas!H$430)","v":0}]
["Cobertura de brazos y piernas artificiales",null,"$30,000 por año y hasta $120,000 de por vida",null,null,"Prima Rider Trasplante Organos",null,"n/a",{"$f":"IF($I$22=FALSE,0,Tablas!D$431)","v":0},{"$f":"IF($I$22=FALSE,0,Tablas!E$431)","v":0},{"$f":"IF($I$22=FALSE,0,Tablas!F$431)","v":0},{"$f":"IF($I$22=FALSE,0,Tablas!G$431)","v":0},{"$f":"IF($I$22=FALSE,0,Tablas!H$431)","v":0}]
["Cobertura extendida para dependientes en caso de muerte de asegurado principal",null,"2 años sin costo",null,null,"TOTAL PRIMA NETA :",null,"n/a",{"$f":"SUM(I41:I45)","v":5957.2000000000007},4478.5,3181.59,2396.13,1896.3400000000001]
[null,null,null,null,null,"Costo Administrativo Anual :",null,"n/a",75,75,75,75,75]
[null,null,null,null,null,"GRAN TOTAL  (1ra Cuota) :",null,"n/a",{"$f":"SUM(I46:I47)","v":6032.2000000000007},{"$f":"SUM(J46:J47)","v":4553.5},{"$f":"SUM(K46:K47)","v":3256.59},{"$f":"SUM(L46:L47)","v":2471.13},{"$f":"SUM(M46:M47)","v":1971.3400000000001}]
[null," ",null,null,null,"GRAN TOTAL  (2da Cuota) :",null,"n/a",{"$f":"I46","v":5957.2000000000007},{"$f":"J46","v":4478.5},3181.59,2396.13,1896.3400000000001]
[null," ",null,null,null,"Tarifas en US $ -  Válidas desde 01 Ene 2013"]

{"sheet":"Secure Care International","index":3,"n_rows":53,"n_cols":22,"rows_kept":53,"cut":false,"hidden":false,"merged":[[16,2,16,3],[52,0,56,4],[20,2,21,3],[20,4,21,4],[39,0,39,5],[29,0,29,5],[50,0,50,5],[18,2,18,3],[17,2,17,3],[6,4,10,4],[4,4,5,4],[4,0,10,3],[12,1,12,4],[14,1,14,4],[47,12,48,19],[47,26,48,33],[0,7,0,19],[0,21,0,33],[22,10,22,11],[22,24,22,25],[45,12,45,19],[45,26,45,33]]}
[null,false,false,null,null,null,null,"RESUMEN DE BENEFICIOS",null,null,null,null,null,null,null,null,null,null,null,null,null,"RESUMEN DE BENEFICIOS"]
[null,null,null," "," "," "]
[]
[]
["Cotización de Seguro Médico Internacional\nBupa Secure Care International\nTarifas en US$ | Validas: 1 de enero de 2024",null,null,null," REGIÓN"]
[]
[null,null,null,null,{"$f":"IF('INGRESO DE DATOS'!W14=\"PERU2020\",\"Perú\",'INGRESO DE DATOS'!W14)","v":"VENEZUELA"}]
[]
[]
[]
[]
[]
["Nombre del asegurado principal",{"$f":"+'INGRESO DE DATOS'!$C$36","v":"John Doe"}]
[]
["Broker/Agente",{"$f":"+'INGRESO DE DATOS'!$C$47","v":"Agencia"}]
[]
["Número de Adultos en la Póliza",{"$f":"+'INGRESO DE DATOS'!$C$38","v":1},"Dependientes (menores de 24 años)",null,{"$f":"+'INGRESO DE DATOS'!$C$40","v":0}]
[null,null,{"$f":"IF('INGRESO DE DATOS'!$P$2=TRUE, \"Cotización para dependiente de 24 años\",\"\")","v":"Cotización para dependiente de 24 años"}]
["Edad del Titular",{"$f":"+'INGRESO DE DATOS'!$C$42","v":24},"Edad del Cónyuge",null,{"$f":"+'INGRESO DE DATOS'!$C$44","v":55}]
[]
[null,null,"Fecha de Cotización:",null,{"$f":"NOW()","v":"2023-12-27T16:02:06.490"}]
[]
[]
[]
["DEDUCIBLES","PLAN 1","PLAN 2","PLAN 3","PLAN 4","PLAN 5"]
["Dentro del pais de residencia","N/A","N/A","N/A","N/A",20000]
["Fuera del pais de residencia",2000,5000,10000,20000,20000]
[]
[]
["TARIFAS ANUALES"]
["Prima de Titular",{"$f":"VLOOKUP($B$19,Tablas!$A$440:$H$463,4,TRUE)","v":1171.9000000000001},{"$f":"VLOOKUP($B$19,Tablas!$A$440:$H$463,5,TRUE)","v":838.45},{"$f":"VLOOKUP($B$19,Tablas!$A$440:$H$463,6,TRUE)","v":727.95},{"$f":"VLOOKUP($B$19,Tablas!$A$440:$H$463,7,TRUE)","v":560.25},{"$f":"VLOOKUP($B$19,Tablas!$A$440:$H$463,8,TRUE)","v":17.5}]
["Prima de Cónyuge",{"$f":"IF($B$17=1,0,(VLOOKUP($E$19,Tablas!$A$440:$H$463,4,TRUE)))","v":0},{"$f":"IF($B$17=1,0,(VLOOKUP($E$19,Tablas!$A$440:$H$463,5,TRUE)))","v":0},{"$f":"IF($B$17=1,0,(VLOOKUP($E$19,Tablas!$A$440:$H$463,6,TRUE)))","v":0},{"$f":"IF($B$17=1,0,(VLOOKUP($E$19,Tablas!$A$440:$H$463,7,TRUE)))","v":0},{"$f":"IF($B$17=1,0,(VLOOKUP($E$19,Tablas!$A$440:$H$463,8,TRUE)))","v":0}]
["Primas Hijos",{"$f":"IF($E$17=0,0,(VLOOKUP($E$17,Tablas!$A$464:$H$466,4,TRUE)))","v":0},{"$f":"IF($E$17=0,0,(VLOOKUP($E$17,Tablas!$A$464:$H$466,5,TRUE)))","v":0},{"$f":"IF($E$17=0,0,(VLOOKUP($E$17,Tablas!$A$464:$H$466,6,TRUE)))","v":0},{"$f":"IF($E$17=0,0,(VLOOKUP($E$17,Tablas!$A$464:$H$466,7,TRUE)))","v":0},{"$f":"IF($E$17=0,0,(VLOOKUP($E$17,Tablas!$A$464:$H$466,8,TRUE)))","v":0}]
["Rider: Complicaciones de  Maternidad",{"$f":"+IF($B$1=FALSE,0,Tablas!D$467)","v":0},{"$f":"+IF($B$1=FALSE,0,Tablas!E$467)","v":0},{"$f":"+IF($B$1=FALSE,0,Tablas!F$467)","v":0},{"$f":"+IF($B$1=FALSE,0,Tablas!G$467)","v":0},{"$f":"+IF($B$1=FALSE,0,Tablas!H$467)","v":0}]
["Rider: Trasplante Organos",{"$f":"IF($C$1=FALSE,0,Tablas!D$468)","v":0},{"$f":"IF($C$1=FALSE,0,Tablas!E$468)","v":0},{"$f":"IF($C$1=FALSE,0,Tablas!F$468)","v":0},{"$f":"IF($C$1=FALSE,0,Tablas!G$468)","v":0},{"$f":"IF($C$1=FALSE,0,Tablas!H$468)","v":0}]
["TOTAL PRIMA NETA",{"$f":"SUM(B31:B35)","v":1171.9000000000001},838.45,727.95,560.25,17.5]
["Costo Administrativo Annual",75,75,75,75,75]
["GRAN TOTAL :",{"$f":"SUM(B36:B37)","v":1246.9000000000001},{"$f":"SUM(C36:C37)","v":913.45},{"$f":"SUM(D36:D37)","v":802.95},{"$f":"SUM(E36:E37)","v":635.25},{"$f":"SUM(F36:F37)","v":92.5}]
[]
["TARIFAS SEMESTRALES"]
["Prima de Titular",{"$f":"VLOOKUP($B$19,Tablas!$A$476:$H$499,4,TRUE)","v":621.10700000000008},{"$f":"VLOOKUP($B$19,Tablas!$A$476:$H$499,5,TRUE)","v":444.37850000000003},{"$f":"VLOOKUP($B$19,Tablas!$A$476:$H$499,6,TRUE)","v":385.81350000000003},{"$f":"VLOOKUP($B$19,Tablas!$A$476:$H$499,7,TRUE)","v":296.9325},{"$f":"VLOOKUP($B$19,Tablas!$A$476:$H$499,8,TRUE)","v":9.2750000000000004}]
["Prima de Cónyuge",{"$f":"IF($B$17=1,0,(VLOOKUP($E$19,Tablas!$A$476:$H$499,4,TRUE)))","v":0},{"$f":"IF($B$17=1,0,(VLOOKUP($E$19,Tablas!$A$476:$H$499,5,TRUE)))","v":0},{"$f":"IF($B$17=1,0,(VLOOKUP($E$19,Tablas!$A$476:$H$499,6,TRUE)))","v":0},{"$f":"IF($B$17=1,0,(VLOOKUP($E$19,Tablas!$A$476:$H$499,7,TRUE)))","v":0},{"$f":"IF($B$17=1,0,(VLOOKUP($E$19,Tablas!$A$476:$H$499,8,TRUE)))","v":0}]
["Primas Hijos",{"$f":"IF($E$17=0,0,(VLOOKUP($E$17,Tablas!$A$500:$H$502,4,TRUE)))","v":0},{"$f":"IF($E$17=0,0,(VLOOKUP($E$17,Tablas!$A$500:$H$502,5,TRUE)))","v":0},{"$f":"IF($E$17=0,0,(VLOOKUP($E$17,Tablas!$A$500:$H$502,6,TRUE)))","v":0},{"$f":"IF($E$17=0,0,(VLOOKUP($E$17,Tablas!$A$500:$H$502,7,TRUE)))","v":0},{"$f":"IF($E$17=0,0,(VLOOKUP($E$17,Tablas!$A$500:$H$502,8,TRUE)))","v":0}]
["Rider: Complicaciones de  Maternidad",{"$f":"+IF($B$1=FALSE,0,Tablas!D$503)","v":0},{"$f":"+IF($B$1=FALSE,0,Tablas!E$503)","v":0},{"$f":"+IF($B$1=FALSE,0,Tablas!F$503)","v":0},{"$f":"+IF($B$1=FALSE,0,Tablas!G$503)","v":0},{"$f":"+IF($B$1=FALSE,0,Tablas!H$503)","v":0}]
["Rider: Trasplante Organos",{"$f":"IF($C$1=FALSE,0,Tablas!D$504)","v":0},{"$f":"IF($C$1=FALSE,0,Tablas!E$504)","v":0},{"$f":"IF($C$1=FALSE,0,Tablas!F$504)","v":0},{"$f":"IF($C$1=FALSE,0,Tablas!G$504)","v":0},{"$f":"IF($C$1=FALSE,0,Tablas!H$504)","v":0}]
["TOTAL PRIMA NETA",{"$f":"SUM(B41:B45)","v":621.10700000000008},444.37850000000003,385.81350000000003,296.9325,9.2750000000000004]
["Costo Administrativo Anual ",75,75,75,75,75]
["TOTAL  (1ra Cuota)",{"$f":"SUM(B46:B47)","v":696.10700000000008},{"$f":"SUM(C46:C47)","v":519.37850000000003},{"$f":"SUM(D46:D47)","v":460.81350000000003},{"$f":"SUM(E46:E47)","v":371.9325},{"$f":"SUM(F46:F47)","v":84.275000000000006}]
["TOTAL  (2da Cuota)",{"$f":"B46","v":621.10700000000008},{"$f":"C46","v":444.37850000000003},385.81350000000003,296.9325,9.2750000000000004]
["GRAN TOTAL",{"$f":"SUM(B48:B49)","v":1317.2140000000002},{"$f":"SUM(C48:C49)","v":963.75700000000006},{"$f":"SUM(D48:D49)","v":846.62700000000007},{"$f":"SUM(E48:E49)","v":668.86500000000001}]
[]
[]
["Este presupuesto solamente tiene carácter informativo y en ningún momento expresa compromiso legal para suministrarle cobertura de seguro. La emisión de una póliza de seguro Bupa está sujeta a todas las evaluaciones de riesgo por parte de Bupa y a la recepción de todos los pagos de prima requeridos."]

{"sheet":"Resumen tarifas anuales","index":4,"n_rows":32,"n_cols":6,"rows_kept":32,"cut":false,"hidden":false,"merged":[[29,0,29,5],[30,0,30,1],[31,0,31,1],[6,4,10,5],[4,4,5,5],[4,0,10,3],[16,2,16,4],[17,2,17,4],[12,10,12,15],[14,10,14,15],[11,2,11,5],[21,0,21,1],[27,0,27,1],[26,0,26,1],[12,1,12,5],[14,1,14,5],[18,3,18,4],[22,0,22,1],[23,0,23,1],[25,0,25,5]]}
[]
[null,null,null,null," "," "]
[]
[]
["Cotización de Seguro Médico Internacional\nBupa International\nTarifas en US$ | Validas: 1 de enero de 2024",null,null,null,"REGIÓN"]
[]
[null,null,null,null,{"$f":"IF('INGRESO DE DATOS'!W14=\"PERU2020\",\"Perú\",'INGRESO DE DATOS'!W14)","v":"VENEZUELA"}]
[]
[]
[]
[]
[]
["Nombre del asegurado principal",{"$f":"+'INGRESO DE DATOS'!$C$36","v":"John Doe"}]
[]
["Broker/Agente",{"$f":"+'INGRESO DE DATOS'!$C$47","v":"Agencia"}]
[]
["Número de Adultos en la Póliza",{"$f":"+'INGRESO DE DATOS'!$C$38","v":1},"Dependientes (menores de 24 años)",null,null,{"$f":"+'INGRESO DE DATOS'!$C$40","v":0}]
[null,null,{"$f":"IF('INGRESO DE DATOS'!$P$2=TRUE, \"Cotización para dependiente de 24 años\",\"\")","v":"Cotización para dependiente de 24 años"}]
["Edad del Titular",{"$f":"+'INGRESO DE DATOS'!$C$42","v":24},null,"Edad del Cónyuge",null,{"$f":"+'INGRESO DE DATOS'!$C$44","v":55}]
[]
[null,null,null,null," "," "]
["DEDUCIBLES",null,"PLAN 1","PLAN 2","PLAN 3","PLAN 4"]
["Dentro del pais de residencia",null,"N/A","N/A","N/A","N/A"]
["Fuera del pais de residencia",null,2000,5000,10000,20000]
[]
["Bupa Privilege Care International"]
["Tarifas Anuales",null,{"$f":"'Privilege Care International'!G37","v":2085.4},{"$f":"'Privilege Care International'!H37","v":1508.8500000000001},{"$f":"'Privilege Care International'!I37","v":1096.75},{"$f":"'Privilege Care International'!J37","v":855.6}]
["Tarifas Semestrales",null,{"$f":"'Privilege Care International'!G49","v":2206.0240000000003},{"$f":"'Privilege Care International'!H49","v":1594.8810000000003},{"$f":"'Privilege Care International'!I49","v":1158.0550000000001},{"$f":"'Privilege Care International'!J49","v":902.43600000000004}]
[]
["Bupa Secure Care International"]
["Tarifas Anuales",null,{"$f":"'Secure Care International'!B38","v":1246.9000000000001},{"$f":"'Secure Care International'!C38","v":913.45},{"$f":"'Secure Care International'!D38","v":802.95},{"$f":"'Secure Care International'!E38","v":635.25}]
["Tarifas Semestrales",null,{"$f":"'Secure Care International'!B50","v":1317.2140000000002},{"$f":"'Secure Care International'!C50","v":963.75700000000006},{"$f":"'Secure Care International'!D50","v":846.62700000000007},{"$f":"'Secure Care International'!E50","v":668.86500000000001}]

{"sheet":"Comparacion de Beneficios","index":5,"n_rows":1,"n_cols":1,"rows_kept":1,"cut":false,"hidden":true,"merged":[[31,7,33,7],[39,5,41,5],[39,6,41,6],[38,7,41,7],[17,0,19,0],[32,6,33,6],[25,2,26,2],[25,3,26,3],[25,4,26,4],[31,2,33,2],[31,3,33,3],[32,4,33,4],[32,5,33,5],[86,0,87,0],[89,0,91,0],[9,0,11,0],[13,0,14,0],[15,0,16,0],[37,0,41,0],[24,0,26,0],[31,0,33,0],[0,0,4,7],[25,5,26,5],[25,6,26,6],[27,0,28,0],[29,0,30,0],[10,4,11,4],[10,5,11,5],[10,6,11,6],[10,7,11,7]]}
["2023 BUPA CARE COMPARACION DE BENEFICIOS"]

{"sheet":"Tablas","index":6,"n_rows":595,"n_cols":62,"rows_kept":595,"cut":false,"hidden":true,"merged":[[582,42,582,44],[79,2,79,6],[148,0,148,7],[149,0,149,1],[149,2,149,6],[582,21,582,22],[183,0,183,7],[184,0,184,1],[184,2,184,6],[219,0,219,7],[253,0,253,7],[254,0,254,1],[254,2,254,6],[221,0,221,1],[221,2,221,6],[220,0,220,7],[4,0,4,7],[5,0,5,7],[41,0,41,1],[41,2,41,6],[40,0,40,7],[6,0,6,1],[6,2,6,6],[77,0,77,7],[111,0,111,7],[112,0,112,1],[112,2,112,6],[147,0,147,7],[78,0,78,7],[79,0,79,1],[328,0,328,7],[292,0,292,7],[293,0,293,7],[294,0,294,1],[294,2,294,6],[508,0,508,7],[435,0,435,7],[436,0,436,7],[437,0,437,1],[437,2,437,6],[329,2,329,6],[365,0,365,7],[472,0,472,7],[473,0,473,1],[473,2,473,6],[329,0,329,1],[399,0,399,7],[400,0,400,1],[400,2,400,6],[366,0,366,7],[367,0,367,1],[367,2,367,6],[583,0,583,1],[509,0,509,7],[510,0,510,1],[510,2,510,6],[544,0,544,7],[545,0,545,1],[545,2,545,6],[583,2,583,6],[581,0,581,19],[584,2,584,4],[591,2,591,4],[591,5,591,7],[591,8,591,10],[590,0,590,1],[590,2,590,6],[584,5,584,7],[584,8,584,10],[1,8,1,9],[4,10,4,11],[4,16,4,17],[584,14,584,16],[591,14,591,16],[591,11,591,13],[584,11,584,13],[584,50,584,52],[591,44,591,46],[591,47,591,49],[591,50,591,52],[590,21,590,22],[584,59,584,61],[589,42,589,61],[591,59,591,61],[584,17,584,19],[582,0,582,19],[589,0,589,19],[591,17,591,19],[589,21,589,40],[591,53,591,55],[591,56,591,58],[584,53,584,55],[584,56,584,58],[590,42,590,43],[590,44,590,48],[584,44,584,46],[584,47,584,49]]}
[null,null,null,null,null,null,null,null,null,null,"Critical","Exclusive","Privilege","Advantage","Secure","Essential"]
[null,"REGIÓN",{"$f":"'INGRESO DE DATOS'!W14","v":"VENEZUELA"},null,"FACTOR SEMESTRAL :",null,0.53,null,"TOTAL DISCOUNT",null,{"$f":"'INGRESO DE DATOS'!O42","v":0.65},{"$f":"'INGRESO DE DATOS'!P42","v":0.65},{"$f":"'INGRESO DE DATOS'!Q42","v":0.65},{"$f":"'INGRESO DE DATOS'!R42","v":0.65},{"$f":"'INGRESO DE DATOS'!S42","v":0.65},{"$f":"'INGRESO DE DATOS'!T42","v":0.65}]
[]
[]
["BUPA EXCLUSIVE CARE",null,null,null,null,null,null,null,null,null,"ORIGINAL RATES",null,null,null,null,null,"DISCOUNTS APPLIED"]
["TARIFAS ANUALES"]
["EDAD"]
[" "," ","DW1","DW2","DW3","DW4","DW5","DW6"]
[18,"18-24",null,{"$f":"Q9","v":17.5},{"$f":"R9","v":17.5},17.5,17.5,17.5,null,null,{"$f":"IF($C$2=2,Venezuela!D9,IF($C$2=3,#REF!,IF($C$2=4,#REF!,IF($C$2=5,#REF!,IF($C$2=6,#REF!,IF($C$2=8,#REF!,IF($C$2=9,#REF!,IF($C$2=\"PERU2020\",#REF!))))))))","v":false},{"$f":"IF($C$2=2,Venezuela!E9,IF($C$2=3,#REF!,IF($C$2=4,#REF!,IF($C$2=5,#REF!,IF($C$2=6,#REF!,IF($C$2=8,#REF!,IF($C$2=9,#REF!,IF($C$2=\"PERU2020\",#REF!))))))))","v":false},{"$f":"IF($C$2=2,Venezuela!F9,IF($C$2=3,#REF!,IF($C$2=4,#REF!,IF($C$2=5,#REF!,IF($C$2=6,#REF!,IF($C$2=8,#REF!,IF($C$2=9,#REF!,IF($C$2=\"PERU2020\",#REF!))))))))","v":false},{"$f":"IF($C$2=2,Venezuela!G9,IF($C$2=3,#REF!,IF($C$2=4,#REF!,IF($C$2=5,#REF!,IF($C$2=6,#REF!,IF($C$2=8,#REF!,IF($C$2=9,#REF!,IF($C$2=\"PERU2020\",#REF!))))))))","v":false},{"$f":"IF($C$2=2,Venezuela!H9,IF($C$2=3,#REF!,IF($C$2=4,#REF!,IF($C$2=5,#REF!,IF($C$2=6,#REF!,IF($C$2=8,#REF!,IF($C$2=9,#REF!,IF($C$2=\"PERU2020\",#REF!))))))))","v":false},null,{"$f":"(K9-50)*$L$2+50","v":17.5},{"$f":"(L9-50)*$L$2+50","v":17.5},17.5,17.5,17.5]
[25,"25-29",null,{"$f":"Q10","v":17.5},{"$f":"R10","v":17.5},{"$f":"S10","v":17.5},{"$f":"T10","v":17.5},{"$f":"U10","v":17.5},null,null,{"$f":"IF($C$2=2,Venezuela!D10,IF($C$2=3,#REF!,IF($C$2=4,#REF!,IF($C$2=5,#REF!,IF($C$2=6,#REF!,IF($C$2=8,#REF!,IF($C$2=9,#REF!,IF($C$2=\"PERU2020\",#REF!))))))))","v":false},{"$f":"IF($C$2=2,Venezuela!E10,IF($C$2=3,#REF!,IF($C$2=4,#REF!,IF($C$2=5,#REF!,IF($C$2=6,#REF!,IF($C$2=8,#REF!,IF($C$2=9,#REF!,IF($C$2=\"PERU2020\",#REF!))))))))","v":false},{"$f":"IF($C$2=2,Venezuela!F10,IF($C$2=3,#REF!,IF($C$2=4,#REF!,IF($C$2=5,#REF!,IF($C$2=6,#REF!,IF($C$2=8,#REF!,IF($C$2=9,#REF!,IF($C$2=\"PERU2020\",#REF!))))))))","v":false},{"$f":"IF($C$2=2,Venezuela!G10,IF($C$2=3,#REF!,IF($C$2=4,#REF!,IF($C$2=5,#REF!,IF($C$2=6,#REF!,IF($C$2=8,#REF!,IF($C$2=9,#REF!,IF($C$2=\"PERU2020\",#REF!))))))))","v":false},{"$f":"IF($C$2=2,Venezuela!H10,IF($C$2=3,#REF!,IF($C$2=4,#REF!,IF($C$2=5,#REF!,IF($C$2=6,#REF!,IF($C$2=8,#REF!,IF($C$2=9,#REF!,IF($C$2=\"PERU2020\",#REF!))))))))","v":false},null,{"$f":"(K10-50)*$L$2+50","v":17.5},{"$f":"(L10-50)*$L$2+50","v":17.5},{"$f":"(M10-50)*$L$2+50","v":17.5},{"$f":"(N10-50)*$L$2+50","v":17.5},{"$f":"(O10-50)*$L$2+50","v":17.5}]
[30,"30-34",null,17.5,17.5,17.5,17.5,17.5,null,null,{"$f":"IF($C$2=2,Venezuela!D11,IF($C$2=3,#REF!,IF($C$2=4,#REF!,IF($C$2=5,#REF!,IF($C$2=6,#REF!,IF($C$2=8,#REF!,IF($C$2=9,#REF!,IF($C$2=\"PERU2020\",#REF!))))))))","v":false},{"$f":"IF($C$2=2,Venezuela!E11,IF($C$2=3,#REF!,IF($C$2=4,#REF!,IF($C$2=5,#REF!,IF($C$2=6,#REF!,IF($C$2=8,#REF!,IF($C$2=9,#REF!,IF($C$2=\"PERU2020\",#REF!))))))))","v":false},{"$f":"IF($C$2=2,Venezuela!F11,IF($C$2=3,#REF!,IF($C$2=4,#REF!,IF($C$2=5,#REF!,IF($C$2=6,#REF!,IF($C$2=8,#REF!,IF($C$2=9,#REF!,IF($C$2=\"PERU2020\",#REF!))))))))","v":false},{"$f":"IF($C$2=2,Venezuela!G11,IF($C$2=3,#REF!,IF($C$2=4,#REF!,IF($C$2=5,#REF!,IF($C$2=6,#REF!,IF($C$2=8,#REF!,IF($C$2=9,#REF!,IF($C$2=\"PERU2020\",#REF!))))))))","v":false},{"$f":"IF($C$2=2,Venezuela!H11,IF($C$2=3,#REF!,IF($C$2=4,#REF!,IF($C$2=5,#REF!,IF($C$2=6,#REF!,IF($C$2=8,#REF!,IF($C$2=9,#REF!,IF($C$2=\"PERU2020\",#REF!))))))))","v":false},null,17.5,17.5,17.5,17.5,17.5]
[35,"35-39",null,17.5,17.5,17.5,17.5,17.5,null,null,{"$f":"IF($C$2=2,Venezuela!D12,IF($C$2=3,#REF!,IF($C$2=4,#REF!,IF($C$2=5,#REF!,IF($C$2=6,#REF!,IF($C$2=8,#REF!,IF($C$2=9,#REF!,IF($C$2=\"PERU2020\",#REF!))))))))","v":false},{"$f":"IF($C$2=2,Venezuela!E12,IF($C$2=3,#REF!,IF($C$2=4,#REF!,IF($C$2=5,#REF!,IF($C$2=6,#REF!,IF($C$2=8,#REF!,IF($C$2=9,#REF!,IF($C$2=\"PERU2020\",#REF!))))))))","v":false},{"$f":"IF($C$2=2,Venezuela!F12,IF($C$2=3,#REF!,IF($C$2=4,#REF!,IF($C$2=5,#REF!,IF($C$2=6,#REF!,IF($C$2=8,#REF!,IF($C$2=9,#REF!,IF($C$2=\"PERU2020\",#REF!))))))))","v":false},{"$f":"IF($C$2=2,Venezuela!G12,IF($C$2=3,#REF!,IF($C$2=4,#REF!,IF($C$2=5,#REF!,IF($C$2=6,#REF!,IF($C$2=8,#REF!,IF($C$2=9,#REF!,IF($C$2=\"PERU2020\",#REF!))))))))","v":false},{"$f":"IF($C$2=2,Venezuela!H12,IF($C$2=3,#REF!,IF($C$2=4,#REF!,IF($C$2=5,#REF!,IF($C$2=6,#REF!,IF($C$2=8,#REF!,IF($C$2=9,#REF!,IF($C$2=\"PERU2020\",#REF!))))))))","v":false},null,17.5,17.5,17.5,17.5,17.5]
[40,"40-44",null,17.5,17.5,17.5,17.5,17.5,null,null,{"$f":"IF($C$2=2,Venezuela!D13,IF($C$2=3,#REF!,IF($C$2=4,#REF!,IF($C$2=5,#REF!,IF($C$2=6,#REF!,IF($C$2=8,#REF!,IF($C$2=9,#REF!,IF($C$2=\"PERU2020\",#REF!))))))))","v":false},{"$f":"IF($C$2=2,Venezuela!E13,IF($C$2=3,#REF!,IF($C$2=4,#REF!,IF($C$2=5,#REF!,IF($C$2=6,#REF!,IF($C$2=8,#REF!,IF($C$2=9,#REF!,IF($C$2=\"PERU2020\",#REF!))))))))","v":false},{"$f":"IF($C$2=2,Venezuela!F13,IF($C$2=3,#REF!,IF($C$2=4,#REF!,IF($C$2=5,#REF!,IF($C$2=6,#REF!,IF($C$2=8,#REF!,IF($C$2=9,#REF!,IF($C$2=\"PERU2020\",#REF!))))))))","v":false},{"$f":"IF($C$2=2,Venezuela!G13,IF($C$2=3,#REF!,IF($C$2=4,#REF!,IF($C$2=5,#REF!,IF($C$2=6,#REF!,IF($C$2=8,#REF!,IF($C$2=9,#REF!,IF($C$2=\"PERU2020\",#REF!))))))))","v":false},{"$f":"IF($C$2=2,Venezuela!H13,IF($C$2=3,#REF!,IF($C$2=4,#REF!,IF($C$2=5,#REF!,IF($C$2=6,#REF!,IF($C$2=8,#REF!,IF($C$2=9,#REF!,IF($C$2=\"PERU2020\",#REF!))))))))","v":false},null,17.5,17.5,17.5,17.5,17.5]
[45,"45-49",null,17.5,17.5,17.5,17.5,17.5,null,null,{"$f":"IF($C$2=2,Venezuela!D14,IF($C$2=3,#REF!,IF($C$2=4,#REF!,IF($C$2=5,#REF!,IF($C$2=6,#REF!,IF($C$2=8,#REF!,IF($C$2=9,#REF!,IF($C$2=\"PERU2020\",#REF!))))))))","v":false},{"$f":"IF($C$2=2,Venezuela!E14,IF($C$2=3,#REF!,IF($C$2=4,#REF!,IF($C$2=5,#REF!,IF($C$2=6,#REF!,IF($C$2=8,#REF!,IF($C$2=9,#REF!,IF($C$2=\"PERU2020\",#REF!))))))))","v":false},{"$f":"IF($C$2=2,Venezuela!F14,IF($C$2=3,#REF!,IF($C$2=4,#REF!,IF($C$2=5,#REF!,IF($C$2=6,#REF!,IF($C$2=8,#REF!,IF($C$2=9,#REF!,IF($C$2=\"PERU2020\",#REF!))))))))","v":false},{"$f":"IF($C$2=2,Venezuela!G14,IF($C$2=3,#REF!,IF($C$2=4,#REF!,IF($C$2=5,#REF!,IF($C$2=6,#REF!,IF($C$2=8,#REF!,IF($C$2=9,#REF!,IF($C$2=\"PERU2020\",#REF!))))))))","v":false},{"$f":"IF($C$2=2,Venezuela!H14,IF($C$2=3,#REF!,IF($C$2=4,#REF!,IF($C$2=5,#REF!,IF($C$2=6,#REF!,IF($C$2=8,#REF!,IF($C$2=9,#REF!,IF($C$2=\"PERU2020\",#REF!))))))))","v":false},null,17.5,17.5,17.5,17.5,17.5]
[50,"50-54",null,17.5,17.5,17.5,17.5,17.5,null,null,{"$f":"IF($C$2=2,Venezuela!D15,IF($C$2=3,#REF!,IF($C$2=4,#REF!,IF($C$2=5,#REF!,IF($C$2=6,#REF!,IF($C$2=8,#REF!,IF($C$2=9,#REF!,IF($C$2=\"PERU2020\",#REF!))))))))","v":false},{"$f":"IF($C$2=2,Venezuela!E15,IF($C$2=3,#REF!,IF($C$2=4,#REF!,IF($C$2=5,#REF!,IF($C$2=6,#REF!,IF($C$2=8,#REF!,IF($C$2=9,#REF!,IF($C$2=\"PERU2020\",#REF!))))))))","v":false},{"$f":"IF($C$2=2,Venezuela!F15,IF($C$2=3,#REF!,IF($C$2=4,#REF!,IF($C$2=5,#REF!,IF($C$2=6,#REF!,IF($C$2=8,#REF!,IF($C$2=9,#REF!,IF($C$2=\"PERU2020\",#REF!))))))))","v":false},{"$f":"IF($C$2=2,Venezuela!G15,IF($C$2=3,#REF!,IF($C$2=4,#REF!,IF($C$2=5,#REF!,IF($C$2=6,#REF!,IF($C$2=8,#REF!,IF($C$2=9,#REF!,IF($C$2=\"PERU2020\",#REF!))))))))","v":false},{"$f":"IF($C$2=2,Venezuela!H15,IF($C$2=3,#REF!,IF($C$2=4,#REF!,IF($C$2=5,#REF!,IF($C$2=6,#REF!,IF($C$2=8,#REF!,IF($C$2=9,#REF!,IF($C$2=\"PERU2020\",#REF!))))))))","v":false},null,17.5,17.5,17.5,17.5,17.5]
[55,"55-59",null,17.5,17.5,17.5,17.5,17.5,null,null,{"$f":"IF($C$2=2,Venezuela!D16,IF($C$2=3,#REF!,IF($C$2=4,#REF!,IF($C$2=5,#REF!,IF($C$2=6,#REF!,IF($C$2=8,#REF!,IF($C$2=9,#REF!,IF($C$2=\"PERU2020\",#REF!))))))))","v":false},{"$f":"IF($C$2=2,Venezuela!E16,IF($C$2=3,#REF!,IF($C$2=4,#REF!,IF($C$2=5,#REF!,IF($C$2=6,#REF!,IF($C$2=8,#REF!,IF($C$2=9,#REF!,IF($C$2=\"PERU2020\",#REF!))))))))","v":false},{"$f":"IF($C$2=2,Venezuela!F16,IF($C$2=3,#REF!,IF($C$2=4,#REF!,IF($C$2=5,#REF!,IF($C$2=6,#REF!,IF($C$2=8,#REF!,IF($C$2=9,#REF!,IF($C$2=\"PERU2020\",#REF!))))))))","v":false},{"$f":"IF($C$2=2,Venezuela!G16,IF($C$2=3,#REF!,IF($C$2=4,#REF!,IF($C$2=5,#REF!,IF($C$2=6,#REF!,IF($C$2=8,#REF!,IF($C$2=9,#REF!,IF($C$2=\"PERU2020\",#REF!))))))))","v":false},{"$f":"IF($C$2=2,Venezuela!H16,IF($C$2=3,#REF!,IF($C$2=4,#REF!,IF($C$2=5,#REF!,IF($C$2=6,#REF!,IF($C$2=8,#REF!,IF($C$2=9,#REF!,IF($C$2=\"PERU2020\",#REF!))))))))","v":false},null,17.5,17.5,17.5,17.5,17.5]
[60,"60",null,17.5,17.5,17.5,17.5,17.5,null,null,{"$f":"IF($C$2=2,Venezuela!D17,IF($C$2=3,#REF!,IF($C$2=4,#REF!,IF($C$2=5,#REF!,IF($C$2=6,#REF!,IF($C$2=8,#REF!,IF($C$2=9,#REF!,IF($C$2=\"PERU2020\",#REF!))))))))","v":false},{"$f":"IF($C$2=2,Venezuela!E17,IF($C$2=3,#REF!,IF($C$2=4,#REF!,IF($C$2=5,#REF!,IF($C$2=6,#REF!,IF($C$2=8,#REF!,IF($C$2=9,#REF!,IF($C$2=\"PERU2020\",#REF!))))))))","v":false},{"$f":"IF($C$2=2,Venezuela!F17,IF($C$2=3,#REF!,IF($C$2=4,#REF!,IF($C$2=5,#REF!,IF($C$2=6,#REF!,IF($C$2=8,#REF!,IF($C$2=9,#REF!,IF($C$2=\"PERU2020\",#REF!))))))))","v":false},{"$f":"IF($C$2=2,Venezuela!G17,IF($C$2=3,#REF!,IF($C$2=4,#REF!,IF($C$2=5,#REF!,IF($C$2=6,#REF!,IF($C$2=8,#REF!,IF($C$2=9,#REF!,IF($C$2=\"PERU2020\",#REF!))))))))","v":false},{"$f":"IF($C$2=2,Venezuela!H17,IF($C$2=3,#REF!,IF($C$2=4,#REF!,IF($C$2=5,#REF!,IF($C$2=6,#REF!,IF($C$2=8,#REF!,IF($C$2=9,#REF!,IF($C$2=\"PERU2020\",#REF!))))))))","v":false},null,17.5,17.5,17.5,17.5,17.5]
[61,"61",null,17.5,17.5,17.5,17.5,17.5,null,null,{"$f":"IF($C$2=2,Venezuela!D18,IF($C$2=3,#REF!,IF($C$2=4,#REF!,IF($C$2=5,#REF!,IF($C$2=6,#REF!,IF($C$2=8,#REF!,IF($C$2=9,#REF!,IF($C$2=\"PERU2020\",#REF!))))))))","v":false},{"$f":"IF($C$2=2,Venezuela!E18,IF($C$2=3,#REF!,IF($C$2=4,#REF!,IF($C$2=5,#REF!,IF($C$2=6,#REF!,IF($C$2=8,#REF!,IF($C$2=9,#REF!,IF($C$2=\"PERU2020\",#REF!))))))))","v":false},{"$f":"IF($C$2=2,Venezuela!F18,IF($C$2=3,#REF!,IF($C$2=4,#REF!,IF($C$2=5,#REF!,IF($C$2=6,#REF!,IF($C$2=8,#REF!,IF($C$2=9,#REF!,IF($C$2=\"PERU2020\",#REF!))))))))","v":false},{"$f":"IF($C$2=2,Venezuela!G18,IF($C$2=3,#REF!,IF($C$2=4,#REF!,IF($C$2=5,#REF!,IF($C$2=6,#REF!,IF($C$2=8,#REF!,IF($C$2=9,#REF!,IF($C$2=\"PERU2020\",#REF!))))))))","v":false},{"$f":"IF($C$2=2,Venezuela!H18,IF($C$2=3,#REF!,IF($C$2=4,#REF!,IF($C$2=5,#REF!,IF($C$2=6,#REF!,IF($C$2=8,#REF!,IF($C$2=9,#REF!,IF($C$2=\"PERU2020\",#REF!))))))))","v":false},null,17.5,17.5,17.5,17.5,17.5]
[62,"62",null,17.5,17.5,17.5,17.5,17.5,null,null,{"$f":"IF($C$2=2,Venezuela!D19,IF($C$2=3,#REF!,IF($C$2=4,#REF!,IF($C$2=5,#REF!,IF($C$2=6,#REF!,IF($C$2=8,#REF!,IF($C$2=9,#REF!,IF($C$2=\"PERU2020\",#REF!))))))))","v":false},{"$f":"IF($C$2=2,Venezuela!E19,IF($C$2=3,#REF!,IF($C$2=4,#REF!,IF($C$2=5,#REF!,IF($C$2=6,#REF!,IF($C$2=8,#REF!,IF($C$2=9,#REF!,IF($C$2=\"PERU2020\",#REF!))))))))","v":false},{"$f":"IF($C$2=2,Venezuela!F19,IF($C$2=3,#REF!,IF($C$2=4,#REF!,IF($C$2=5,#REF!,IF($C$2=6,#REF!,IF($C$2=8,#REF!,IF($C$2=9,#REF!,IF($C$2=\"PERU2020\",#REF!))))))))","v":false},{"$f":"IF($C$2=2,Venezuela!G19,IF($C$2=3,#REF!,IF($C$2=4,#REF!,IF($C$2=5,#REF!,IF($C$2=6,#REF!,IF($C$2=8,#REF!,IF($C$2=9,#REF!,IF($C$2=\"PERU2020\",#REF!))))))))","v":false},{"$f":"IF($C$2=2,Venezuela!H19,IF($C$2=3,#REF!,IF($C$2=4,#REF!,IF($C$2=5,#REF!,IF($C$2=6,#REF!,IF($C$2=8,#REF!,IF($C$2=9,#REF!,IF($C$2=\"PERU2020\",#REF!))))))))","v":false},null,17.5,17.5,17.5,17.5,17.5]
[63,"63",null,17.5,17.5,17.5,17.5,17.5,null,null,{"$f":"IF($C$2=2,Venezuela!D20,IF($C$2=3,#REF!,IF($C$2=4,#REF!,IF($C$2=5,#REF!,IF($C$2=6,#REF!,IF($C$2=8,#REF!,IF($C$2=9,#REF!,IF($C$2=\"PERU2020\",#REF!))))))))","v":false},{"$f":"IF($C$2=2,Venezuela!E20,IF($C$2=3,#REF!,IF($C$2=4,#REF!,IF($C$2=5,#REF!,IF($C$2=6,#REF!,IF($C$2=8,#REF!,IF($C$2=9,#REF!,IF($C$2=\"PERU2020\",#REF!))))))))","v":false},{"$f":"IF($C$2=2,Venezuela!F20,IF($C$2=3,#REF!,IF($C$2=4,#REF!,IF($C$2=5,#REF!,IF($C$2=6,#REF!,IF($C$2=8,#REF!,IF($C$2=9,#REF!,IF($C$2=\"PERU2020\",#REF!))))))))","v":false},{"$f":"IF($C$2=2,Venezuela!G20,IF($C$2=3,#REF!,IF($C$2=4,#REF!,IF($C$2=5,#REF!,IF($C$2=6,#REF!,IF($C$2=8,#REF!,IF($C$2=9,#REF!,IF($C$2=\"PERU2020\",#REF!))))))))","v":false},{"$f":"IF($C$2=2,Venezuela!H20,IF($C$2=3,#REF!,IF($C$2=4,#REF!,IF($C$2=5,#REF!,IF($C$2=6,#REF!,IF($C$2=8,#REF!,IF($C$2=9,#REF!,IF($C$2=\"PERU2020\",#REF!))))))))","v":false},null,17.5,17.5,17.5,17.5,17.5]
[64,"64",null,17.5,17.5,17.5,17.5,17.5,null,null,{"$f":"IF($C$2=2,Venezuela!D21,IF($C$2=3,#REF!,IF($C$2=4,#REF!,IF($C$2=5,#REF!,IF($C$2=6,#REF!,IF($C$2=8,#REF!,IF($C$2=9,#REF!,IF($C$2=\"PERU2020\",#REF!))))))))","v":false},{"$f":"IF($C$2=2,Venezuela!E21,IF($C$2=3,#REF!,IF($C$2=4,#REF!,IF($C$2=5,#REF!,IF($C$2=6,#REF!,IF($C$2=8,#REF!,IF($C$2=9,#REF!,IF($C$2=\"PERU2020\",#REF!))))))))","v":false},{"$f":"IF($C$2=2,Venezuela!F21,IF($C$2=3,#REF!,IF($C$2=4,#REF!,IF($C$2=5,#REF!,IF($C$2=6,#REF!,IF($C$2=8,#REF!,IF($C$2=9,#REF!,IF($C$2=\"PERU2020\",#REF!))))))))","v":false},{"$f":"IF($C$2=2,Venezuela!G21,IF($C$2=3,#REF!,IF($C$2=4,#REF!,IF($C$2=5,#REF!,IF($C$2=6,#REF!,IF($C$2=8,#REF!,IF($C$2=9,#REF!,IF($C$2=\"PERU2020\",#REF!))))))))","v":false},{"$f":"IF($C$2=2,Venezuela!H21,IF($C$2=3,#REF!,IF($C$2=4,#REF!,IF($C$2=5,#REF!,IF($C$2=6,#REF!,IF($C$2=8,#REF!,IF($C$2=9,#REF!,IF($C$2=\"PERU2020\",#REF!))))))))","v":false},null,17.5,17.5,17.5,17.5,17.5]
[65,"65",null,17.5,17.5,17.5,17.5,17.5,null,null,{"$f":"IF($C$2=2,Venezuela!D22,IF($C$2=3,#REF!,IF($C$2=4,#REF!,IF($C$2=5,#REF!,IF($C$2=6,#REF!,IF($C$2=8,#REF!,IF($C$2=9,#REF!,IF($C$2=\"PERU2020\",#REF!))))))))","v":false},{"$f":"IF($C$2=2,Venezuela!E22,IF($C$2=3,#REF!,IF($C$2=4,#REF!,IF($C$2=5,#REF!,IF($C$2=6,#REF!,IF($C$2=8,#REF!,IF($C$2=9,#REF!,IF($C$2=\"PERU2020\",#REF!))))))))","v":false},{"$f":"IF($C$2=2,Venezuela!F22,IF($C$2=3,#REF!,IF($C$2=4,#REF!,IF($C$2=5,#REF!,IF($C$2=6,#REF!,IF($C$2=8,#REF!,IF($C$2=9,#REF!,IF($C$2=\"PERU2020\",#REF!))))))))","v":false},{"$f":"IF($C$2=2,Venezuela!G22,IF($C$2=3,#REF!,IF($C$2=4,#REF!,IF($C$2=5,#REF!,IF($C$2=6,#REF!,IF($C$2=8,#REF!,IF($C$2=9,#REF!,IF($C$2=\"PERU2020\",#REF!))))))))","v":false},{"$f":"IF($C$2=2,Venezuela!H22,IF($C$2=3,#REF!,IF($C$2=4,#REF!,IF($C$2=5,#REF!,IF($C$2=6,#REF!,IF($C$2=8,#REF!,IF($C$2=9,#REF!,IF($C$2=\"PERU2020\",#REF!))))))))","v":false},null,17.5,17.5,17.5,17.5,17.5]
[66,"66",null,17.5,17.5,17.5,17.5,17.5,null,null,{"$f":"IF($C$2=2,Venezuela!D23,IF($C$2=3,#REF!,IF($C$2=4,#REF!,IF($C$2=5,#REF!,IF($C$2=6,#REF!,IF($C$2=8,#REF!,IF($C$2=9,#REF!,IF($C$2=\"PERU2020\",#REF!))))))))","v":false},{"$f":"IF($C$2=2,Venezuela!E23,IF($C$2=3,#REF!,IF($C$2=4,#REF!,IF($C$2=5,#REF!,IF($C$2=6,#REF!,IF($C$2=8,#REF!,IF($C$2=9,#REF!,IF($C$2=\"PERU2020\",#REF!))))))))","v":false},{"$f":"IF($C$2=2,Venezuela!F23,IF($C$2=3,#REF!,IF($C$2=4,#REF!,IF($C$2=5,#REF!,IF($C$2=6,#REF!,IF($C$2=8,#REF!,IF($C$2=9,#REF!,IF($C$2=\"PERU2020\",#REF!))))))))","v":false},{"$f":"IF($C$2=2,Venezuela!G23,IF($C$2=3,#REF!,IF($C$2=4,#REF!,IF($C$2=5,#REF!,IF($C$2=6,#REF!,IF($C$2=8,#REF!,IF($C$2=9,#REF!,IF($C$2=\"PERU2020\",#REF!))))))))","v":false},{"$f":"IF($C$2=2,Venezuela!H23,IF($C$2=3,#REF!,IF($C$2=4,#REF!,IF($C$2=5,#REF!,IF($C$2=6,#REF!,IF($C$2=8,#REF!,IF($C$2=9,#REF!,IF($C$2=\"PERU2020\",#REF!))))))))","v":false},null,17.5,17.5,17.5,17.5,17.5]
[67,"67",null,17.5,17.5,17.5,17.5,17.5,null,null,{"$f":"IF($C$2=2,Venezuela!D24,IF($C$2=3,#REF!,IF($C$2=4,#REF!,IF($C$2=5,#REF!,IF($C$2=6,#REF!,IF($C$2=8,#REF!,IF($C$2=9,#REF!,IF($C$2=\"PERU2020\",#REF!))))))))","v":false},{"$f":"IF($C$2=2,Venezuela!E24,IF($C$2=3,#REF!,IF($C$2=4,#REF!,IF($C$2=5,#REF!,IF($C$2=6,#REF!,IF($C$2=8,#REF!,IF($C$2=9,#REF!,IF($C$2=\"PERU2020\",#REF!))))))))","v":false},{"$f":"IF($C$2=2,Venezuela!F24,IF($C$2=3,#REF!,IF($C$2=4,#REF!,IF($C$2=5,#REF!,IF($C$2=6,#REF!,IF($C$2=8,#REF!,IF($C$2=9,#REF!,IF($C$2=\"PERU2020\",#REF!))))))))","v":false},{"$f":"IF($C$2=2,Venezuela!G24,IF($C$2=3,#REF!,IF($C$2=4,#REF!,IF($C$2=5,#REF!,IF($C$2=6,#REF!,IF($C$2=8,#REF!,IF($C$2=9,#REF!,IF($C$2=\"PERU2020\",#REF!))))))))","v":false},{"$f":"IF($C$2=2,Venezuela!H24,IF($C$2=3,#REF!,IF($C$2=4,#REF!,IF($C$2=5,#REF!,IF($C$2=6,#REF!,IF($C$2=8,#REF!,IF($C$2=9,#REF!,IF($C$2=\"PERU2020\",#REF!))))))))","v":false},null,17.5,17.5,17.5,17.5,17.5]
[68,"68",null,17.5,17.5,17.5,17.5,17.5,null,null,{"$f":"IF($C$2=2,Venezuela!D25,IF($C$2=3,#REF!,IF($C$2=4,#REF!,IF($C$2=5,#REF!,IF($C$2=6,#REF!,IF($C$2=8,#REF!,IF($C$2=9,#REF!,IF($C$2=\"PERU2020\",#REF!))))))))","v":false},{"$f":"IF($C$2=2,Venezuela!E25,IF($C$2=3,#REF!,IF($C$2=4,#REF!,IF($C$2=5,#REF!,IF($C$2=6,#REF!,IF($C$2=8,#REF!,IF($C$2=9,#REF!,IF($C$2=\"PERU2020\",#REF!))))))))","v":false},{"$f":"IF($C$2=2,Venezuela!F25,IF($C$2=3,#REF!,IF($C$2=4,#REF!,IF($C$2=5,#REF!,IF($C$2=6,#REF!,IF($C$2=8,#REF!,IF($C$2=9,#REF!,IF($C$2=\"PERU2020\",#REF!))))))))","v":false},{"$f":"IF($C$2=2,Venezuela!G25,IF($C$2=3,#REF!,IF($C$2=4,#REF!,IF($C$2=5,#REF!,IF($C$2=6,#REF!,IF($C$2=8,#REF!,IF($C$2=9,#REF!,IF($C$2=\"PERU2020\",#REF!))))))))","v":false},{"$f":"IF($C$2=2,Venezuela!H25,IF($C$2=3,#REF!,IF($C$2=4,#REF!,IF($C$2=5,#REF!,IF($C$2=6,#REF!,IF($C$2=8,#REF!,IF($C$2=9,#REF!,IF($C$2=\"PERU2020\",#REF!))))))))","v":false},null,17.5,17.5,17.5,17.5,17.5]
[69,"69",null,17.5,17.5,17.5,17.5,17.5,null,null,{"$f":"IF($C$2=2,Venezuela!D26,IF($C$2=3,#REF!,IF($C$2=4,#REF!,IF($C$2=5,#REF!,IF($C$2=6,#REF!,IF($C$2=8,#REF!,IF($C$2=9,#REF!,IF($C$2=\"PERU2020\",#REF!))))))))","v":false},{"$f":"IF($C$2=2,Venezuela!E26,IF($C$2=3,#REF!,IF($C$2=4,#REF!,IF($C$2=5,#REF!,IF($C$2=6,#REF!,IF($C$2=8,#REF!,IF($C$2=9,#REF!,IF($C$2=\"PERU2020\",#REF!))))))))","v":false},{"$f":"IF($C$2=2,Venezuela!F26,IF($C$2=3,#REF!,IF($C$2=4,#REF!,IF($C$2=5,#REF!,IF($C$2=6,#REF!,IF($C$2=8,#REF!,IF($C$2=9,#REF!,IF($C$2=\"PERU2020\",#REF!))))))))","v":false},{"$f":"IF($C$2=2,Venezuela!G26,IF($C$2=3,#REF!,IF($C$2=4,#REF!,IF($C$2=5,#REF!,IF($C$2=6,#REF!,IF($C$2=8,#REF!,IF($C$2=9,#REF!,IF($C$2=\"PERU2020\",#REF!))))))))","v":false},{"$f":"IF($C$2=2,Venezuela!H26,IF($C$2=3,#REF!,IF($C$2=4,#REF!,IF($C$2=5,#REF!,IF($C$2=6,#REF!,IF($C$2=8,#REF!,IF($C$2=9,#REF!,IF($C$2=\"PERU2020\",#REF!))))))))","v":false},null,17.5,17.5,17.5,17.5,17.5]
[70,"70",null,17.5,17.5,17.5,17.5,17.5,null,null,{"$f":"IF($C$2=2,Venezuela!D27,IF($C$2=3,#REF!,IF($C$2=4,#REF!,IF($C$2=5,#REF!,IF($C$2=6,#REF!,IF($C$2=8,#REF!,IF($C$2=9,#REF!,IF($C$2=\"PERU2020\",#REF!))))))))","v":false},{"$f":"IF($C$2=2,Venezuela!E27,IF($C$2=3,#REF!,IF($C$2=4,#REF!,IF($C$2=5,#REF!,IF($C$2=6,#REF!,IF($C$2=8,#REF!,IF($C$2=9,#REF!,IF($C$2=\"PERU2020\",#REF!))))))))","v":false},{"$f":"IF($C$2=2,Venezuela!F27,IF($C$2=3,#REF!,IF($C$2=4,#REF!,IF($C$2=5,#REF!,IF($C$2=6,#REF!,IF($C$2=8,#REF!,IF($C$2=9,#REF!,IF($C$2=\"PERU2020\",#REF!))))))))","v":false},{"$f":"IF($C$2=2,Venezuela!G27,IF($C$2=3,#REF!,IF($C$2=4,#REF!,IF($C$2=5,#REF!,IF($C$2=6,#REF!,IF($C$2=8,#REF!,IF($C$2=9,#REF!,IF($C$2=\"PERU2020\",#REF!))))))))","v":false},{"$f":"IF($C$2=2,Venezuela!H27,IF($C$2=3,#REF!,IF($C$2=4,#REF!,IF($C$2=5,#REF!,IF($C$2=6,#REF!,IF($C$2=8,#REF!,IF($C$2=9,#REF!,IF($C$2=\"PERU2020\",#REF!))))))))","v":false},null,17.5,17.5,17.5,17.5,17.5]
[71,"71",null,17.5,17.5,17.5,17.5,17.5,null,null,{"$f":"IF($C$2=2,Venezuela!D28,IF($C$2=3,#REF!,IF($C$2=4,#REF!,IF($C$2=5,#REF!,IF($C$2=6,#REF!,IF($C$2=8,#REF!,IF($C$2=9,#REF!,IF($C$2=\"PERU2020\",#REF!))))))))","v":false},{"$f":"IF($C$2=2,Venezuela!E28,IF($C$2=3,#REF!,IF($C$2=4,#REF!,IF($C$2=5,#REF!,IF($C$2=6,#REF!,IF($C$2=8,#REF!,IF($C$2=9,#REF!,IF($C$2=\"PERU2020\",#REF!))))))))","v":false},{"$f":"IF($C$2=2,Venezuela!F28,IF($C$2=3,#REF!,IF($C$2=4,#REF!,IF($C$2=5,#REF!,IF($C$2=6,#REF!,IF($C$2=8,#REF!,IF($C$2=9,#REF!,IF($C$2=\"PERU2020\",#REF!))))))))","v":false},{"$f":"IF($C$2=2,Venezuela!G28,IF($C$2=3,#REF!,IF($C$2=4,#REF!,IF($C$2=5,#REF!,IF($C$2=6,#REF!,IF($C$2=8,#REF!,IF($C$2=9,#REF!,IF($C$2=\"PERU2020\",#REF!))))))))","v":false},{"$f":"IF($C$2=2,Venezuela!H28,IF($C$2=3,#REF!,IF($C$2=4,#REF!,IF($C$2=5,#REF!,IF($C$2=6,#REF!,IF($C$2=8,#REF!,IF($C$2=9,#REF!,IF($C$2=\"PERU2020\",#REF!))))))))","v":false},null,17.5,17.5,17.5,17.5,17.5]
[72,"72",null,17.5,17.5,17.5,17.5,17.5,null,null,{"$f":"IF($C$2=2,Venezuela!D29,IF($C$2=3,#REF!,IF($C$2=4,#REF!,IF($C$2=5,#REF!,IF($C$2=6,#REF!,IF($C$2=8,#REF!,IF($C$2=9,#REF!,IF($C$2=\"PERU2020\",#REF!))))))))","v":false},{"$f":"IF($C$2=2,Venezuela!E29,IF($C$2=3,#REF!,IF($C$2=4,#REF!,IF($C$2=5,#REF!,IF($C$2=6,#REF!,IF($C$2=8,#REF!,IF($C$2=9,#REF!,IF($C$2=\"PERU2020\",#REF!))))))))","v":false},{"$f":"IF($C$2=2,Venezuela!F29,IF($C$2=3,#REF!,IF($C$2=4,#REF!,IF($C$2=5,#REF!,IF($C$2=6,#REF!,IF($C$2=8,#REF!,IF($C$2=9,#REF!,IF($C$2=\"PERU2020\",#REF!))))))))","v":false},{"$f":"IF($C$2=2,Venezuela!G29,IF($C$2=3,#REF!,IF($C$2=4,#REF!,IF($C$2=5,#REF!,IF($C$2=6,#REF!,IF($C$2=8,#REF!,IF($C$2=9,#REF!,IF($C$2=\"PERU2020\",#REF!))))))))","v":false},{"$f":"IF($C$2=2,Venezuela!H29,IF($C$2=3,#REF!,IF($C$2=4,#REF!,IF($C$2=5,#REF!,IF($C$2=6,#REF!,IF($C$2=8,#REF!,IF($C$2=9,#REF!,IF($C$2=\"PERU2020\",#REF!))))))))","v":false},null,17.5,17.5,17.5,17.5,17.5]
[73,"73",null,17.5,17.5,17.5,17.5,17.5,null,null,{"$f":"IF($C$2=2,Venezuela!D30,IF($C$2=3,#REF!,IF($C$2=4,#REF!,IF($C$2=5,#REF!,IF($C$2=6,#REF!,IF($C$2=8,#REF!,IF($C$2=9,#REF!,IF($C$2=\"PERU2020\",#REF!))))))))","v":false},{"$f":"IF($C$2=2,Venezuela!E30,IF($C$2=3,#REF!,IF($C$2=4,#REF!,IF($C$2=5,#REF!,IF($C$2=6,#REF!,IF($C$2=8,#REF!,IF($C$2=9,#REF!,IF($C$2=\"PERU2020\",#REF!))))))))","v":false},{"$f":"IF($C$2=2,Venezuela!F30,IF($C$2=3,#REF!,IF($C$2=4,#REF!,IF($C$2=5,#REF!,IF($C$2=6,#REF!,IF($C$2=8,#REF!,IF($C$2=9,#REF!,IF($C$2=\"PERU2020\",#REF!))))))))","v":false},{"$f":"IF($C$2=2,Venezuela!G30,IF($C$2=3,#REF!,IF($C$2=4,#REF!,IF($C$2=5,#REF!,IF($C$2=6,#REF!,IF($C$2=8,#REF!,IF($C$2=9,#REF!,IF($C$2=\"PERU2020\",#REF!))))))))","v":false},{"$f":"IF($C$2=2,Venezuela!H30,IF($C$2=3,#REF!,IF($C$2=4,#REF!,IF($C$2=5,#REF!,IF($C$2=6,#REF!,IF($C$2=8,#REF!,IF($C$2=9,#REF!,IF($C$2=\"PERU2020\",#REF!))))))))","v":false},null,17.5,17.5,17.5,17.5,17.5]
[74,"74",null,17.5,17.5,17.5,17.5,17.5,null,null,{"$f":"IF($C$2=2,Venezuela!D31,IF($C$2=3,#REF!,IF($C$2=4,#REF!,IF($C$2=5,#REF!,IF($C$2=6,#REF!,IF($C$2=8,#REF!,IF($C$2=9,#REF!,IF($C$2=\"PERU2020\",#REF!))))))))","v":false},{"$f":"IF($C$2=2,Venezuela!E31,IF($C$2=3,#REF!,IF($C$2=4,#REF!,IF($C$2=5,#REF!,IF($C$2=6,#REF!,IF($C$2=8,#REF!,IF($C$2=9,#REF!,IF($C$2=\"PERU2020\",#REF!))))))))","v":false},{"$f":"IF($C$2=2,Venezuela!F31,IF($C$2=3,#REF!,IF($C$2=4,#REF!,IF($C$2=5,#REF!,IF($C$2=6,#REF!,IF($C$2=8,#REF!,IF($C$2=9,#REF!,IF($C$2=\"PERU2020\",#REF!))))))))","v":false},{"$f":"IF($C$2=2,Venezuela!G31,IF($C$2=3,#REF!,IF($C$2=4,#REF!,IF($C$2=5,#REF!,IF($C$2=6,#REF!,IF($C$2=8,#REF!,IF($C$2=9,#REF!,IF($C$2=\"PERU2020\",#REF!))))))))","v":false},{"$f":"IF($C$2=2,Venezuela!H31,IF($C$2=3,#REF!,IF($C$2=4,#REF!,IF($C$2=5,#REF!,IF($C$2=6,#REF!,IF($C$2=8,#REF!,IF($C$2=9,#REF!,IF($C$2=\"PERU2020\",#REF!))))))))","v":false},null,17.5,17.5,17.5,17.5,17.5]
[75,"75+",null,17.5,17.5,17.5,17.5,17.5,null,null,{"$f":"IF($C$2=2,Venezuela!D32,IF($C$2=3,#REF!,IF($C$2=4,#REF!,IF($C$2=5,#REF!,IF($C$2=6,#REF!,IF($C$2=8,#REF!,IF($C$2=9,#REF!,IF($C$2=\"PERU2020\",#REF!))))))))","v":false},{"$f":"IF($C$2=2,Venezuela!E32,IF($C$2=3,#REF!,IF($C$2=4,#REF!,IF($C$2=5,#REF!,IF($C$2=6,#REF!,IF($C$2=8,#REF!,IF($C$2=9,#REF!,IF($C$2=\"PERU2020\",#REF!))))))))","v":false},{"$f":"IF($C$2=2,Venezuela!F32,IF($C$2=3,#REF!,IF($C$2=4,#REF!,IF($C$2=5,#REF!,IF($C$2=6,#REF!,IF($C$2=8,#REF!,IF($C$2=9,#REF!,IF($C$2=\"PERU2020\",#REF!))))))))","v":false},{"$f":"IF($C$2=2,Venezuela!G32,IF($C$2=3,#REF!,IF($C$2=4,#REF!,IF($C$2=5,#REF!,IF($C$2=6,#REF!,IF($C$2=8,#REF!,IF($C$2=9,#REF!,IF($C$2=\"PERU2020\",#REF!))))))))","v":false},{"$f":"IF($C$2=2,Venezuela!H32,IF($C$2=3,#REF!,IF($C$2=4,#REF!,IF($C$2=5,#REF!,IF($C$2=6,#REF!,IF($C$2=8,#REF!,IF($C$2=9,#REF!,IF($C$2=\"PERU2020\",#REF!))))))))","v":false},null,17.5,17.5,17.5,17.5,17.5]
[1,"1 Child",null,0,0,0,0,0,null,null,{"$f":"IF($C$2=2,Venezuela!D33,IF($C$2=3,#REF!,IF($C$2=4,#REF!,IF($C$2=5,#REF!,IF($C$2=6,#REF!,IF($C$2=8,#REF!,IF($C$2=9,#REF!,IF($C$2=\"PERU2020\",#REF!))))))))","v":false},{"$f":"IF($C$2=2,Venezuela!E33,IF($C$2=3,#REF!,IF($C$2=4,#REF!,IF($C$2=5,#REF!,IF($C$2=6,#REF!,IF($C$2=8,#REF!,IF($C$2=9,#REF!,IF($C$2=\"PERU2020\",#REF!))))))))","v":false},{"$f":"IF($C$2=2,Venezuela!F33,IF($C$2=3,#REF!,IF($C$2=4,#REF!,IF($C$2=5,#REF!,IF($C$2=6,#REF!,IF($C$2=8,#REF!,IF($C$2=9,#REF!,IF($C$2=\"PERU2020\",#REF!))))))))","v":false},{"$f":"IF($C$2=2,Venezuela!G33,IF($C$2=3,#REF!,IF($C$2=4,#REF!,IF($C$2=5,#REF!,IF($C$2=6,#REF!,IF($C$2=8,#REF!,IF($C$2=9,#REF!,IF($C$2=\"PERU2020\",#REF!))))))))","v":false},{"$f":"IF($C$2=2,Venezuela!H33,IF($C$2=3,#REF!,IF($C$2=4,#REF!,IF($C$2=5,#REF!,IF($C$2=6,#REF!,IF($C$2=8,#REF!,IF($C$2=9,#REF!,IF($C$2=\"PERU2020\",#REF!))))))))","v":false},null,{"$f":"(K33)*$L$2","v":0},{"$f":"(L33)*$L$2","v":0},0,0,0]
[2,"2 Children",null,0,0,0,0,0,null,null,{"$f":"IF($C$2=2,Venezuela!D34,IF($C$2=3,#REF!,IF($C$2=4,#REF!,IF($C$2=5,#REF!,IF($C$2=6,#REF!,IF($C$2=8,#REF!,IF($C$2=9,#REF!,IF($C$2=\"PERU2020\",#REF!))))))))","v":false},{"$f":"IF($C$2=2,Venezuela!E34,IF($C$2=3,#REF!,IF($C$2=4,#REF!,IF($C$2=5,#REF!,IF($C$2=6,#REF!,IF($C$2=8,#REF!,IF($C$2=9,#REF!,IF($C$2=\"PERU2020\",#REF!))))))))","v":false},{"$f":"IF($C$2=2,Venezuela!F34,IF($C$2=3,#REF!,IF($C$2=4,#REF!,IF($C$2=5,#REF!,IF($C$2=6,#REF!,IF($C$2=8,#REF!,IF($C$2=9,#REF!,IF($C$2=\"PERU2020\",#REF!))))))))","v":false},{"$f":"IF($C$2=2,Venezuela!G34,IF($C$2=3,#REF!,IF($C$2=4,#REF!,IF($C$2=5,#REF!,IF($C$2=6,#REF!,IF($C$2=8,#REF!,IF($C$2=9,#REF!,IF($C$2=\"PERU2020\",#REF!))))))))","v":false},{"$f":"IF($C$2=2,Venezuela!H34,IF($C$2=3,#REF!,IF($C$2=4,#REF!,IF($C$2=5,#REF!,IF($C$2=6,#REF!,IF($C$2=8,#REF!,IF($C$2=9,#REF!,IF($C$2=\"PERU2020\",#REF!))))))))","v":false},null,{"$f":"(K34)*$L$2","v":0},{"$f":"(L34)*$L$2","v":0},{"$f":"(M34)*$L$2","v":0},{"$f":"(N34)*$L$2","v":0},{"$f":"(O34)*$L$2","v":0}]
[3,"3+ Children",null,0,0,0,0,0,null,null,{"$f":"IF($C$2=2,Venezuela!D35,IF($C$2=3,#REF!,IF($C$2=4,#REF!,IF($C$2=5,#REF!,IF($C$2=6,#REF!,IF($C$2=8,#REF!,IF($C$2=9,#REF!,IF($C$2=\"PERU2020\",#REF!))))))))","v":false},{"$f":"IF($C$2=2,Venezuela!E35,IF($C$2=3,#REF!,IF($C$2=4,#REF!,IF($C$2=5,#REF!,IF($C$2=6,#REF!,IF($C$2=8,#REF!,IF($C$2=9,#REF!,IF($C$2=\"PERU2020\",#REF!))))))))","v":false},{"$f":"IF($C$2=2,Venezuela!F35,IF($C$2=3,#REF!,IF($C$2=4,#REF!,IF($C$2=5,#REF!,IF($C$2=6,#REF!,IF($C$2=8,#REF!,IF($C$2=9,#REF!,IF($C$2=\"PERU2020\",#REF!))))))))","v":false},{"$f":"IF($C$2=2,Venezuela!G35,IF($C$2=3,#REF!,IF($C$2=4,#REF!,IF($C$2=5,#REF!,IF($C$2=6,#REF!,IF($C$2=8,#REF!,IF($C$2=9,#REF!,IF($C$2=\"PERU2020\",#REF!))))))))","v":false},{"$f":"IF($C$2=2,Venezuela!H35,IF($C$2=3,#REF!,IF($C$2=4,#REF!,IF($C$2=5,#REF!,IF($C$2=6,#REF!,IF($C$2=8,#REF!,IF($C$2=9,#REF!,IF($C$2=\"PERU2020\",#REF!))))))))","v":false},null,0,0,0,0,0]
[1,"Rider Comp. Maternidad",null,0,0,225,225,225]
[1,"Transplante de organos",null,0,0,0,0,0]
[]
[]
[]
["TARIFAS SEMESTRALES "]
["EDAD"]
[" "," ",null,"DW2","DW3","DW4","DW5","DW6"]
[18,"18-24",null,{"$f":"$G$2*D9","v":9.2750000000000004},9.2750000000000004,9.2750000000000004,9.2750000000000004,9.2750000000000004]
[25,"25-29",null,9.2750000000000004,9.2750000000000004,9.2750000000000004,9.2750000000000004,9.2750000000000004]
[30,"30-34",null,9.2750000000000004,9.2750000000000004,9.2750000000000004,9.2750000000000004,9.2750000000000004]
[35,"35-39",null,9.2750000000000004,9.2750000000000004,9.2750000000000004,9.2750000000000004,9.2750000000000004]
[40,"40-44",null,9.2750000000000004,9.2750000000000004,9.2750000000000004,9.2750000000000004,9.2750000000000004]
[45,"45-49",null,9.2750000000000004,9.2750000000000004,9.2750000000000004,9.2750000000000004,9.2750000000000004]
[50,"50-54",null,9.2750000000000004,9.2750000000000004,9.2750000000000004,9.2750000000000004,9.2750000000000004]
[55,"55-59",null,9.2750000000000004,9.2750000000000004,9.2750000000000004,9.2750000000000004,9.2750000000000004]
[60,"60",null,9.2750000000000004,9.2750000000000004,9.2750000000000004,9.2750000000000004,9.2750000000000004]
[61,"61",null,9.2750000000000004,9.2750000000000004,9.2750000000000004,9.2750000000000004,9.2750000000000004]
[62,"62",null,{"$f":"$G$2*D19","v":9.2750000000000004},9.2750000000000004,9.2750000000000004,9.2750000000000004,9.2750000000000004]
[63,"63",null,9.2750000000000004,9.2750000000000004,9.2750000000000004,9.2750000000000004,9.2750000000000004]
[64,"64",null,9.2750000000000004,9.2750000000000004,9.2750000000000004,9.2750000000000004,9.2750000000000004]
[65,"65",null,9.2750000000000004,9.2750000000000004,9.2750000000000004,9.2750000000000004,9.2750000000000004]
[66,"66",null,9.2750000000000004,9.2750000000000004,9.2750000000000004,9.2750000000000004,9.2750000000000004]
[67,"67",null,9.2750000000000004,9.2750000000000004,9.2750000000000004,9.2750000000000004,9.2750000000000004]
[68,"68",null,9.2750000000000004,9.2750000000000004,9.2750000000000004,9.2750000000000004,9.2750000000000004]
[69,"69",null,9.2750000000000004,9.2750000000000004,9.2750000000000004,9.2750000000000004,9.2750000000000004]
[70,"70",null,9.2750000000000004,9.2750000000000004,9.2750000000000004,9.2750000000000004,9.2750000000000004]
[71,"71",null,9.2750000000000004,9.2750000000000004,9.2750000000000004,9.2750000000000004,9.2750000000000004]
[72,"72",null,{"$f":"$G$2*D29","v":9.2750000000000004},9.2750000000000004,9.2750000000000004,9.2750000000000004,9.2750000000000004]
[73,"73",null,9.2750000000000004,9.2750000000000004,9.2750000000000004,9.2750000000000004,9.2750000000000004]
[74,"74",null,9.2750000000000004,9.2750000000000004,9.2750000000000004,9.2750000000000004,9.2750000000000004]
[75,"75+",null,9.2750000000000004,9.2750000000000004,9.2750000000000004,9.2750000000000004,9.2750000000000004]
[1,"1 Child",null,0,0,0,0,0]
[2,"2 Children",null,0,0,0,0,0]
[3,"3+ Children",null,0,0,0,0,0]
[1,"Rider Comp. Maternidad",null,{"$f":"+D36*$G$2","v":0},0,119.25,119.25,119.25]
[1,"Transplante de organos",null,0,0,0,0,0]
[]
[]
[]
[]
[]
["DIAMOND (LATINAMERICA ONLY)"]
["TARIFAS ANUALES"]
["EDAD"]
[" "," ","DL1","DL2","DL3","DL4","DL5","DL6"]
[18,"-  24"]
[25,"-  29"]
[30,"-  34"]
[35,"-  39"]
[40,"-  44"]
[45,"-  49"]
[50,"-  54"]
[55,"-  59"]
[60]
[61]
[62]
[63]
[64]
[65]
[66]
[67]
[68]
[69]
[70]
[71]
[72]
[73]
[74]
[75,"o más"]
[1,"Hijo"]
[2,"Hijos"]
[3,"Hijos o más"]
[1,"Rider Comp. Maternidad"]
[1,"Transplante de organos",0,0,0,0,0,0]
[]
["TARIFAS SEMESTRALES "]
["EDAD"]
[" "," ","DL1","DL2","DL3","DL4","DL5","DL6"]
[18,"-  24",{"$f":"+C82*$G$2","v":0},0,0,0,0,0]
[25,"-  29",0,0,0,0,0,0]
[30,"-  34",0,0,0,0,0,0]
[35,"-  39",0,0,0,0,0,0]
[40,"-  44",0,0,0,0,0,0]
[45,"-  49",0,0,0,0,0,0]
[50,"-  54",0,0,0,0,0,0]
[55,"-  59",0,0,0,0,0,0]
[60,null,0,0,0,0,0,0]
[61,null,0,0,0,0,0,0]
[62,null,{"$f":"+C92*$G$2","v":0},0,0,0,0,0]
[63,null,0,0,0,0,0,0]
[64,null,0,0,0,0,0,0]
[65,null,0,0,0,0,0,0]
[66,null,0,0,0,0,0,0]
[67,null,0,0,0,0,0,0]
[68,null,0,0,0,0,0,0]
[69,null,0,0,0,0,0,0]
[70,null,0,0,0,0,0,0]
[71,null,0,0,0,0,0,0]
[72,null,{"$f":"+C102*$G$2","v":0},0,0,0,0,0]
[73,null,0,0,0,0,0,0]
[74,null,0,0,0,0,0,0]
[75,"o más",0,0,0,0,0,0]
[1,"Hijo",0,0,0,0,0,0]
[2,"Hijos",0,0,0,0,0,0]
[3,"Hijos o más",0,0,0,0,0,0]
[1,"Rider Comp. Maternidad",0,0,0,0,0,0]
[1,"Transplante de organos",0,0,0,0,0,0]
[]
[]
[]
[]
["BUPA PRIVILEGE CARE"]
["TARIFAS ANUALES"]
["EDAD"]
[" "," ","CW1","CW2","CW3","CW4","CW5","CW6"]
[18,"18-24",null,{"$f":"Q152","v":2010.4},{"$f":"R152","v":1433.8500000000001},1021.75,780.6,null,null,null,{"$f":"Venezuela!D152","v":3066},{"$f":"Venezuela!E152","v":2179},{"$f":"Venezuela!F152","v":1545},{"$f":"Venezuela!G152","v":1174},{"$f":"Venezuela!H152","v":0},null,{"$f":"(K152-50)*$M$2+50","v":2010.4},{"$f":"(L152-50)*$M$2+50","v":1433.8500000000001},{"$f":"(M152-50)*$M$2+50","v":1021.75},{"$f":"(N152-50)*$M$2+50","v":780.6},{"$f":"(O152-50)*$M$2+50","v":17.5}]
[25,"25-29",null,{"$f":"Q153","v":2225.5500000000002},{"$f":"R153","v":1586.6000000000001},{"$f":"S153","v":1129.6500000000001},{"$f":"T153","v":865.75},null,null,null,{"$f":"Venezuela!D153","v":3397},{"$f":"Venezuela!E153","v":2414},{"$f":"Venezuela!F153","v":1711},{"$f":"Venezuela!G153","v":1305},{"$f":"Venezuela!H153","v":0},null,2225.5500000000002,1586.6000000000001,1129.6500000000001,865.75,17.5]
[30,"30-34",null,2493.35,1777.05,1364.3,1045.1500000000001,null,null,null,{"$f":"Venezuela!D154","v":3809},{"$f":"Venezuela!E154","v":2707},{"$f":"Venezuela!F154","v":2072},{"$f":"Venezuela!G154","v":1581},{"$f":"Venezuela!H154","v":0},null,2493.35,1777.05,1364.3,1045.1500000000001,17.5]
[35,"35-39",null,2788.4500000000003,1987.65,1525.5,1169.3,null,null,null,{"$f":"Venezuela!D155","v":4263},{"$f":"Venezuela!E155","v":3031},{"$f":"Venezuela!F155","v":2320},{"$f":"Venezuela!G155","v":1772},{"$f":"Venezuela!H155","v":0},null,2788.4500000000003,1987.65,1525.5,1169.3,17.5]
[40,"40-44",null,3099.15,2208,1679.55,1286.3,null,null,null,{"$f":"Venezuela!D156","v":4741},{"$f":"Venezuela!E156","v":3370},{"$f":"Venezuela!F156","v":2557},{"$f":"Venezuela!G156","v":1952},{"$f":"Venezuela!H156","v":0},null,3099.15,2208,1679.55,1286.3,17.5]
[45,"45-49",null,3463.15,2468,1874.55,1436.45,null,null,null,{"$f":"Venezuela!D157","v":5301},{"$f":"Venezuela!E157","v":3770},{"$f":"Venezuela!F157","v":2857},{"$f":"Venezuela!G157","v":2183},{"$f":"Venezuela!H157","v":0},null,3463.15,2468,1874.55,1436.45,17.5]
[50,"50-54",null,4540.2,3232.4,2668.85,2044.2,null,null,null,{"$f":"Venezuela!D158","v":6958},{"$f":"Venezuela!E158","v":4946},{"$f":"Venezuela!F158","v":4079},{"$f":"Venezuela!G158","v":3118},{"$f":"Venezuela!H158","v":0},null,4540.2,3232.4,2668.85,2044.2,17.5]
[55,"55-59",null,4830.1000000000004,3438.4500000000003,2837.85,2175.5,null,null,null,{"$f":"Venezuela!D159","v":7404},{"$f":"Venezuela!E159","v":5263},{"$f":"Venezuela!F159","v":4339},{"$f":"Venezuela!G159","v":3320},{"$f":"Venezuela!H159","v":0},null,4830.1000000000004,3438.4500000000003,2837.85,2175.5,17.5]
[60,"60",null,5492.45,3909.7000000000003,3372.15,2710.4500000000003,null,null,null,{"$f":"Venezuela!D160","v":8423},{"$f":"Venezuela!E160","v":5988},{"$f":"Venezuela!F160","v":5161},{"$f":"Venezuela!G160","v":4143},{"$f":"Venezuela!H160","v":0},null,5492.45,3909.7000000000003,3372.15,2710.4500000000003,17.5]
[61,"61",null,5898.7,4198.3,3621.75,2910,null,null,null,{"$f":"Venezuela!D161","v":9048},{"$f":"Venezuela!E161","v":6432},{"$f":"Venezuela!F161","v":5545},{"$f":"Venezuela!G161","v":4450},{"$f":"Venezuela!H161","v":0},null,5898.7,4198.3,3621.75,2910,17.5]
[62,"62",null,6458.35,4596.75,3963,3186.25,null,null,null,{"$f":"Venezuela!D162","v":9909},{"$f":"Venezuela!E162","v":7045},{"$f":"Venezuela!F162","v":6070},{"$f":"Venezuela!G162","v":4875},{"$f":"Venezuela!H162","v":0},null,6458.35,4596.75,3963,3186.25,17.5]
[63,"63",null,6863.3,4884.7,4211.95,3387.1,null,null,null,{"$f":"Venezuela!D163","v":10532},{"$f":"Venezuela!E163","v":7488},{"$f":"Venezuela!F163","v":6453},{"$f":"Venezuela!G163","v":5184},{"$f":"Venezuela!H163","v":0},null,6863.3,4884.7,4211.95,3387.1,17.5]
[64,"64",null,7422.95,5281.85,4555.8,3662.7000000000003,null,null,null,{"$f":"Venezuela!D164","v":11393},{"$f":"Venezuela!E164","v":8099},{"$f":"Venezuela!F164","v":6982},{"$f":"Venezuela!G164","v":5608},{"$f":"Venezuela!H164","v":0},null,7422.95,5281.85,4555.8,3662.7000000000003,17.5]
[65,"65",null,9380.75,6673.5,6066.4000000000005,5157.05,null,null,null,{"$f":"Venezuela!D165","v":14405},{"$f":"Venezuela!E165","v":10240},{"$f":"Venezuela!F165","v":9306},{"$f":"Venezuela!G165","v":7907},{"$f":"Venezuela!H165","v":0},null,9380.75,6673.5,6066.4000000000005,5157.05,17.5]
[66,"66",null,10897.85,7751.85,7047.9000000000005,5989.05,null,null,null,{"$f":"Venezuela!D166","v":16739},{"$f":"Venezuela!E166","v":11899},{"$f":"Venezuela!F166","v":10816},{"$f":"Venezuela!G166","v":9187},{"$f":"Venezuela!H166","v":0},null,10897.85,7751.85,7047.9000000000005,5989.05,17.5]
[67,"67",null,11900.800000000001,8464.25,7695.95,6537.6500000000005,null,null,null,{"$f":"Venezuela!D167","v":18282},{"$f":"Venezuela!E167","v":12995},{"$f":"Venezuela!F167","v":11813},{"$f":"Venezuela!G167","v":10031},{"$f":"Venezuela!H167","v":0},null,11900.800000000001,8464.25,7695.95,6537.6500000000005,17.5]
[68,"68",null,13176.75,9372.3000000000011,8522.1,7237.05,null,null,null,{"$f":"Venezuela!D168","v":20245},{"$f":"Venezuela!E168","v":14392},{"$f":"Venezuela!F168","v":13084},{"$f":"Venezuela!G168","v":11107},{"$f":"Venezuela!H168","v":0},null,13176.75,9372.3000000000011,8522.1,7237.05,17.5]
[69,"69",null,14496.25,10310.25,9372.3000000000011,7962.45,null,null,null,{"$f":"Venezuela!D169","v":22275},{"$f":"Venezuela!E169","v":15835},{"$f":"Venezuela!F169","v":14392},{"$f":"Venezuela!G169","v":12223},{"$f":"Venezuela!H169","v":0},null,14496.25,10310.25,9372.3000000000011,7962.45,17.5]
[70,"70",null,17055.95,12128.95,10918,9360.6,null,null,null,{"$f":"Venezuela!D170","v":26213},{"$f":"Venezuela!E170","v":18633},{"$f":"Venezuela!F170","v":16770},{"$f":"Venezuela!G170","v":14374},{"$f":"Venezuela!H170","v":0},null,17055.95,12128.95,10918,9360.6,17.5]
[71,"71",null,17728.05,12607.35,11344.4,9726.5500000000011,null,null,null,{"$f":"Venezuela!D171","v":27247},{"$f":"Venezuela!E171","v":19369},{"$f":"Venezuela!F171","v":17426},{"$f":"Venezuela!G171","v":14937},{"$f":"Venezuela!H171","v":0},null,17728.05,12607.35,11344.4,9726.5500000000011,17.5]
[72,"72",null,18227.900000000001,12962.25,11666.800000000001,10002.800000000001,null,null,null,{"$f":"Venezuela!D172","v":28016},{"$f":"Venezuela!E172","v":19915},{"$f":"Venezuela!F172","v":17922},{"$f":"Venezuela!G172","v":15362},{"$f":"Venezuela!H172","v":0},null,18227.900000000001,12962.25,11666.800000000001,10002.800000000001,17.5]
[73,"73",null,18898.7,13439.35,12093.2,10371.35,null,null,null,{"$f":"Venezuela!D173","v":29048},{"$f":"Venezuela!E173","v":20649},{"$f":"Venezuela!F173","v":18578},{"$f":"Venezuela!G173","v":15929},{"$f":"Venezuela!H173","v":0},null,18898.7,13439.35,12093.2,10371.35,17.5]
[74,"74",null,19228.25,13673.35,12307.7,10553.35,null,null,null,{"$f":"Venezuela!D174","v":29555},{"$f":"Venezuela!E174","v":21009},{"$f":"Venezuela!F174","v":18908},{"$f":"Venezuela!G174","v":16209},{"$f":"Venezuela!H174","v":0},null,19228.25,13673.35,12307.7,10553.35,17.5]
[75,"75+",null,20067.400000000001,14270.050000000001,12842,11010.95,null,null,null,{"$f":"Venezuela!D175","v":30846},{"$f":"Venezuela!E175","v":21927},{"$f":"Venezuela!F175","v":19730},{"$f":"Venezuela!G175","v":16913},{"$f":"Venezuela!H175","v":0},null,20067.400000000001,14270.050000000001,12842,11010.95,17.5]
[1,"1 Child",null,810.55000000000007,577.20000000000005,486.2,360.1,null,null,null,{"$f":"Venezuela!D176","v":1247},{"$f":"Venezuela!E176","v":888},{"$f":"Venezuela!F176","v":748},{"$f":"Venezuela!G176","v":554},{"$f":"Venezuela!H176","v":0},null,{"$f":"(K176)*$M$2","v":810.55000000000007},577.20000000000005,486.2,360.1,0]
[2,"2 Children",null,1287,915.2,772.85,570.70000000000005,null,null,null,{"$f":"Venezuela!D177","v":1980},{"$f":"Venezuela!E177","v":1408},{"$f":"Venezuela!F177","v":1189},{"$f":"Venezuela!G177","v":878},{"$f":"Venezuela!H177","v":0},null,1287,915.2,772.85,570.70000000000005,0]
[3,"3+ Children",null,1886.95,1340.95,1132.95,836.55000000000007,null,null,null,{"$f":"Venezuela!D178","v":2903},{"$f":"Venezuela!E178","v":2063},{"$f":"Venezuela!F178","v":1743},{"$f":"Venezuela!G178","v":1287},{"$f":"Venezuela!H178","v":0},null,1886.95,1340.95,1132.95,836.55000000000007,0]
[1,"Rider Comp. Maternidad",null,{"$f":"K179","v":225},{"$f":"L179","v":225},225,225,null,null,null,225,225,225,225]
[1,"Transplante de organos",null,{"$f":"K180","v":0},{"$f":"L180","v":0},{"$f":"M180","v":0},{"$f":"N180","v":0},null,null,null,0,0,0,0,0]
[null,null,null,0,0,0,0]
[]
[]
["TARIFAS SEMESTRALES "]
["EDAD"]
[" "," ",null,"CW2","CW3","CW4","CW5","CW6"]
[18,"18-24",null,{"$f":"$G$2*D152","v":1065.5120000000002},759.94050000000016,541.52750000000003,413.71800000000002,0]
[25,"25-29",null,1179.5415000000003,840.89800000000014,598.71450000000004,458.84750000000003,0]
[30,"30-34",null,1321.4755,941.8365,723.07900000000006,553.92950000000008,0]
[35,"35-39",null,1477.8785000000003,1053.4545000000001,808.51499999999999,619.72900000000004,0]
[40,"40-44",null,1642.5495000000001,1170.24,890.16150000000005,681.73900000000003,0]
[45,"45-49",null,1835.4695000000002,1308.04,993.51150000000007,761.31850000000009,0]
[50,"50-54",null,2406.306,1713.172,1414.4905000000001,1083.4260000000002,0]
[55,"55-59",null,2559.9530000000004,1822.3785000000003,1504.0605,1153.0150000000001,0]
[60,"60",null,2910.9985000000001,2072.1410000000001,1787.2395000000001,1436.5385000000001,0]
[61,"61",null,3126.3110000000001,2225.0990000000002,1919.5275000000001,1542.3000000000002,0]
[62,"62",null,{"$f":"$G$2*D162","v":3422.9255000000003},2436.2775000000001,2100.3900000000003,1688.7125000000001,0]
[63,"63",null,3637.5490000000004,2588.8910000000001,2232.3335000000002,1795.163,0]
[64,"64",null,3934.1635000000001,2799.3805000000002,2414.5740000000001,1941.2310000000002,0]
[65,"65",null,4971.7975000000006,3536.9550000000004,3215.1920000000005,2733.2365000000004,0]
[66,"66",null,5775.8605000000007,4108.4805000000006,3735.3870000000006,3174.1965000000005,0]
[67,"67",null,6307.4240000000009,4486.0524999999998,4078.8535000000002,3464.9545000000003,0]
[68,"68",null,6983.6775000000007,4967.3190000000004,4516.7130000000006,3835.6365000000001,0]
[69,"69",null,7683.0125000000007,5464.4324999999999,4967.3190000000004,4220.0985000000001,0]
[70,"70",null,9039.6535000000003,6428.3435000000009,5786.54,4961.1180000000004,0]
[71,"71",null,9395.8665000000001,6681.8955000000005,6012.5320000000002,5155.0715000000009,0]
[72,"72",null,{"$f":"$G$2*D172","v":9660.7870000000021},6869.9925000000003,6183.4040000000005,5301.4840000000013,0]
[73,"73",null,10016.311000000002,7122.8555000000006,6409.3960000000006,5496.8155000000006,0]
[74,"74",null,10190.9725,7246.875500000001,6523.081000000001,5593.2755000000006,0]
[75,"75+",null,10635.722000000002,7563.1265000000012,6806.26,5835.8035000000009,0]
[1,"1 Child",null,429.59150000000005,305.91600000000005,257.68599999999998,190.85300000000001,0]
[2,"2 Children",null,682.11,485.05600000000004,409.61050000000006,302.47100000000006,0]
[3,"3+ Children",null,1000.0835000000001,710.70350000000008,600.46350000000007,443.37150000000008,0]
[1,"Rider Comp. Maternidad",null,{"$f":"+D179*$G$2","v":119.25},119.25,119.25,119.25,0]
[1,"Transplante de organos",null,0,0,0,0,0]
[]
[]
[]
[]
["COMPLETE (LATINAMERICA ONLY)"]
["TARIFAS ANUALES"]
["EDAD"]
[" "," ","CL1","CL2","CL3","CL4","CL5","CL6"]
[18,"-  24"]
[25,"-  29"]
[30,"-  34"]
[35,"-  39"]
[40,"-  44"]
[45,"-  49"]
[50,"-  54"]
[55,"-  59"]
[60]
[61]
[62]
[63]
[64]
[65]
[66]
[67]
[68]
[69]
[70]
[71]
[72]
[73]
[74]
[75,"o más"]
[1,"Hijo"]
[2,"Hijos"]
[3,"Hijos o más"]
[1,"Rider Comp. Maternidad"]
[1,"Transplante de organos",0,0,0,0,0,0]
[]
["TARIFAS SEMESTRALES "]
["EDAD"]
[" "," ","CL1","CL2","CL3","CL4","CL5","CL6"]
[18,"-  24",{"$f":"+C224*$G$2","v":0},0,0,0,0,0]
[25,"-  29",0,0,0,0,0,0]
[30,"-  34",0,0,0,0,0,0]
[35,"-  39",0,0,0,0,0,0]
[40,"-  44",0,0,0,0,0,0]
[45,"-  49",0,0,0,0,0,0]
[50,"-  54",0,0,0,0,0,0]
[55,"-  59",0,0,0,0,0,0]
[60,null,0,0,0,0,0,0]
[61,null,0,0,0,0,0,0]
[62,null,{"$f":"+C234*$G$2","v":0},0,0,0,0,0]
[63,null,0,0,0,0,0,0]
[64,null,0,0,0,0,0,0]
[65,null,0,0,0,0,0,0]
[66,null,0,0,0,0,0,0]
[67,null,0,0,0,0,0,0]
[68,null,0,0,0,0,0,0]
[69,null,0,0,0,0,0,0]
[70,null,0,0,0,0,0,0]
[71,null,0,0,0,0,0,0]
[72,null,{"$f":"+C244*$G$2","v":0},0,0,0,0,0]
[73,null,0,0,0,0,0,0]
[74,null,0,0,0,0,0,0]
[75,"o más",0,0,0,0,0,0]
[1,"Hijo",0,0,0,0,0,0]
[2,"Hijos",0,0,0,0,0,0]
[3,"Hijos o más",0,0,0,0,0,0]
[1,"Rider Comp. Maternidad",0,0,0,0,0,0]
[1,"Transplante de organos",0,0,0,0,0,0]
[]
[]
[]
[]
[]
[]
[]
["BUPA ADVANTAGE CARE (WORLDWIDE)"]
["TARIFAS ANUALES"]
["EDAD"]
[" "," ",null,"AW2","AW3","AW4","AW5","AW6"]
[18,"18-24",null,{"$f":"Q297","v":17.5},{"$f":"R297","v":17.5},17.5,17.5,17.5,null,null,{"$f":"IF($C$2=2,Venezuela!D297,IF($C$2=3,#REF!,IF($C$2=4,#REF!,IF($C$2=5,#REF!,IF($C$2=6,#REF!,IF($C$2=8,#REF!,IF($C$2=9,#REF!,IF($C$2=\"PERU2020\",#REF!))))))))","v":false},{"$f":"IF($C$2=2,Venezuela!E297,IF($C$2=3,#REF!,IF($C$2=4,#REF!,IF($C$2=5,#REF!,IF($C$2=6,#REF!,IF($C$2=8,#REF!,IF($C$2=9,#REF!,IF($C$2=\"PERU2020\",#REF!))))))))","v":false},{"$f":"IF($C$2=2,Venezuela!F297,IF($C$2=3,#REF!,IF($C$2=4,#REF!,IF($C$2=5,#REF!,IF($C$2=6,#REF!,IF($C$2=8,#REF!,IF($C$2=9,#REF!,IF($C$2=\"PERU2020\",#REF!))))))))","v":false},{"$f":"IF($C$2=2,Venezuela!G297,IF($C$2=3,#REF!,IF($C$2=4,#REF!,IF($C$2=5,#REF!,IF($C$2=6,#REF!,IF($C$2=8,#REF!,IF($C$2=9,#REF!,IF($C$2=\"PERU2020\",#REF!))))))))","v":false},{"$f":"IF($C$2=2,Venezuela!H297,IF($C$2=3,#REF!,IF($C$2=4,#REF!,IF($C$2=5,#REF!,IF($C$2=6,#REF!,IF($C$2=8,#REF!,IF($C$2=9,#REF!,IF($C$2=\"PERU2020\",#REF!))))))))","v":false},null,{"$f":"(K297-50)*$N$2+50","v":17.5},{"$f":"(L297-50)*$N$2+50","v":17.5},17.5,17.5,17.5]
[25,"25-29",null,{"$f":"Q298","v":17.5},{"$f":"R298","v":17.5},{"$f":"S298","v":17.5},{"$f":"T298","v":17.5},{"$f":"U298","v":17.5},null,null,{"$f":"IF($C$2=2,Venezuela!D298,IF($C$2=3,#REF!,IF($C$2=4,#REF!,IF($C$2=5,#REF!,IF($C$2=6,#REF!,IF($C$2=8,#REF!,IF($C$2=9,#REF!,IF($C$2=\"PERU2020\",#REF!))))))))","v":false},{"$f":"IF($C$2=2,Venezuela!E298,IF($C$2=3,#REF!,IF($C$2=4,#REF!,IF($C$2=5,#REF!,IF($C$2=6,#REF!,IF($C$2=8,#REF!,IF($C$2=9,#REF!,IF($C$2=\"PERU2020\",#REF!))))))))","v":false},{"$f":"IF($C$2=2,Venezuela!F298,IF($C$2=3,#REF!,IF($C$2=4,#REF!,IF($C$2=5,#REF!,IF($C$2=6,#REF!,IF($C$2=8,#REF!,IF($C$2=9,#REF!,IF($C$2=\"PERU2020\",#REF!))))))))","v":false},{"$f":"IF($C$2=2,Venezuela!G298,IF($C$2=3,#REF!,IF($C$2=4,#REF!,IF($C$2=5,#REF!,IF($C$2=6,#REF!,IF($C$2=8,#REF!,IF($C$2=9,#REF!,IF($C$2=\"PERU2020\",#REF!))))))))","v":false},{"$f":"IF($C$2=2,Venezuela!H298,IF($C$2=3,#REF!,IF($C$2=4,#REF!,IF($C$2=5,#REF!,IF($C$2=6,#REF!,IF($C$2=8,#REF!,IF($C$2=9,#REF!,IF($C$2=\"PERU2020\",#REF!))))))))","v":false},null,{"$f":"(K298-50)*$N$2+50","v":17.5},{"$f":"(L298-50)*$N$2+50","v":17.5},{"$f":"(M298-50)*$N$2+50","v":17.5},{"$f":"(N298-50)*$N$2+50","v":17.5},{"$f":"(O298-50)*$N$2+50","v":17.5}]
[30,"30-34",null,17.5,17.5,17.5,17.5,17.5,null,null,{"$f":"IF($C$2=2,Venezuela!D299,IF($C$2=3,#REF!,IF($C$2=4,#REF!,IF($C$2=5,#REF!,IF($C$2=6,#REF!,IF($C$2=8,#REF!,IF($C$2=9,#REF!,IF($C$2=\"PERU2020\",#REF!))))))))","v":false},{"$f":"IF($C$2=2,Venezuela!E299,IF($C$2=3,#REF!,IF($C$2=4,#REF!,IF($C$2=5,#REF!,IF($C$2=6,#REF!,IF($C$2=8,#REF!,IF($C$2=9,#REF!,IF($C$2=\"PERU2020\",#REF!))))))))","v":false},{"$f":"IF($C$2=2,Venezuela!F299,IF($C$2=3,#REF!,IF($C$2=4,#REF!,IF($C$2=5,#REF!,IF($C$2=6,#REF!,IF($C$2=8,#REF!,IF($C$2=9,#REF!,IF($C$2=\"PERU2020\",#REF!))))))))","v":false},{"$f":"IF($C$2=2,Venezuela!G299,IF($C$2=3,#REF!,IF($C$2=4,#REF!,IF($C$2=5,#REF!,IF($C$2=6,#REF!,IF($C$2=8,#REF!,IF($C$2=9,#REF!,IF($C$2=\"PERU2020\",#REF!))))))))","v":false},{"$f":"IF($C$2=2,Venezuela!H299,IF($C$2=3,#REF!,IF($C$2=4,#REF!,IF($C$2=5,#REF!,IF($C$2=6,#REF!,IF($C$2=8,#REF!,IF($C$2=9,#REF!,IF($C$2=\"PERU2020\",#REF!))))))))","v":false},null,17.5,17.5,17.5,17.5,17.5]
[35,"35-39",null,17.5,17.5,17.5,17.5,17.5,null,null,{"$f":"IF($C$2=2,Venezuela!D300,IF($C$2=3,#REF!,IF($C$2=4,#REF!,IF($C$2=5,#REF!,IF($C$2=6,#REF!,IF($C$2=8,#REF!,IF($C$2=9,#REF!,IF($C$2=\"PERU2020\",#REF!))))))))","v":false},{"$f":"IF($C$2=2,Venezuela!E300,IF($C$2=3,#REF!,IF($C$2=4,#REF!,IF($C$2=5,#REF!,IF($C$2=6,#REF!,IF($C$2=8,#REF!,IF($C$2=9,#REF!,IF($C$2=\"PERU2020\",#REF!))))))))","v":false},{"$f":"IF($C$2=2,Venezuela!F300,IF($C$2=3,#REF!,IF($C$2=4,#REF!,IF($C$2=5,#REF!,IF($C$2=6,#REF!,IF($C$2=8,#REF!,IF($C$2=9,#REF!,IF($C$2=\"PERU2020\",#REF!))))))))","v":false},{"$f":"IF($C$2=2,Venezuela!G300,IF($C$2=3,#REF!,IF($C$2=4,#REF!,IF($C$2=5,#REF!,IF($C$2=6,#REF!,IF($C$2=8,#REF!,IF($C$2=9,#REF!,IF($C$2=\"PERU2020\",#REF!))))))))","v":false},{"$f":"IF($C$2=2,Venezuela!H300,IF($C$2=3,#REF!,IF($C$2=4,#REF!,IF($C$2=5,#REF!,IF($C$2=6,#REF!,IF($C$2=8,#REF!,IF($C$2=9,#REF!,IF($C$2=\"PERU2020\",#REF!))))))))","v":false},null,17.5,17.5,17.5,17.5,17.5]
[40,"40-44",null,17.5,17.5,17.5,17.5,17.5,null,null,{"$f":"IF($C$2=2,Venezuela!D301,IF($C$2=3,#REF!,IF($C$2=4,#REF!,IF($C$2=5,#REF!,IF($C$2=6,#REF!,IF($C$2=8,#REF!,IF($C$2=9,#REF!,IF($C$2=\"PERU2020\",#REF!))))))))","v":false},{"$f":"IF($C$2=2,Venezuela!E301,IF($C$2=3,#REF!,IF($C$2=4,#REF!,IF($C$2=5,#REF!,IF($C$2=6,#REF!,IF($C$2=8,#REF!,IF($C$2=9,#REF!,IF($C$2=\"PERU2020\",#REF!))))))))","v":false},{"$f":"IF($C$2=2,Venezuela!F301,IF($C$2=3,#REF!,IF($C$2=4,#REF!,IF($C$2=5,#REF!,IF($C$2=6,#REF!,IF($C$2=8,#REF!,IF($C$2=9,#REF!,IF($C$2=\"PERU2020\",#REF!))))))))","v":false},{"$f":"IF($C$2=2,Venezuela!G301,IF($C$2=3,#REF!,IF($C$2=4,#REF!,IF($C$2=5,#REF!,IF($C$2=6,#REF!,IF($C$2=8,#REF!,IF($C$2=9,#REF!,IF($C$2=\"PERU2020\",#REF!))))))))","v":false},{"$f":"IF($C$2=2,Venezuela!H301,IF($C$2=3,#REF!,IF($C$2=4,#REF!,IF($C$2=5,#REF!,IF($C$2=6,#REF!,IF($C$2=8,#REF!,IF($C$2=9,#REF!,IF($C$2=\"PERU2020\",#REF!))))))))","v":false},null,17.5,17.5,17.5,17.5,17.5]
[45,"45-49",null,17.5,17.5,17.5,17.5,17.5,null,null,{"$f":"IF($C$2=2,Venezuela!D302,IF($C$2=3,#REF!,IF($C$2=4,#REF!,IF($C$2=5,#REF!,IF($C$2=6,#REF!,IF($C$2=8,#REF!,IF($C$2=9,#REF!,IF($C$2=\"PERU2020\",#REF!))))))))","v":false},{"$f":"IF($C$2=2,Venezuela!E302,IF($C$2=3,#REF!,IF($C$2=4,#REF!,IF($C$2=5,#REF!,IF($C$2=6,#REF!,IF($C$2=8,#REF!,IF($C$2=9,#REF!,IF($C$2=\"PERU2020\",#REF!))))))))","v":false},{"$f":"IF($C$2=2,Venezuela!F302,IF($C$2=3,#REF!,IF($C$2=4,#REF!,IF($C$2=5,#REF!,IF($C$2=6,#REF!,IF($C$2=8,#REF!,IF($C$2=9,#REF!,IF($C$2=\"PERU2020\",#REF!))))))))","v":false},{"$f":"IF($C$2=2,Venezuela!G302,IF($C$2=3,#REF!,IF($C$2=4,#REF!,IF($C$2=5,#REF!,IF($C$2=6,#REF!,IF($C$2=8,#REF!,IF($C$2=9,#REF!,IF($C$2=\"PERU2020\",#REF!))))))))","v":false},{"$f":"IF($C$2=2,Venezuela!H302,IF($C$2=3,#REF!,IF($C$2=4,#REF!,IF($C$2=5,#REF!,IF($C$2=6,#REF!,IF($C$2=8,#REF!,IF($C$2=9,#REF!,IF($C$2=\"PERU2020\",#REF!))))))))","v":false},null,17.5,17.5,17.5,17.5,17.5]
[50,"50-54",null,17.5,17.5,17.5,17.5,17.5,null,null,{"$f":"IF($C$2=2,Venezuela!D303,IF($C$2=3,#REF!,IF($C$2=4,#REF!,IF($C$2=5,#REF!,IF($C$2=6,#REF!,IF($C$2=8,#REF!,IF($C$2=9,#REF!,IF($C$2=\"PERU2020\",#REF!))))))))","v":false},{"$f":"IF($C$2=2,Venezuela!E303,IF($C$2=3,#REF!,IF($C$2=4,#REF!,IF($C$2=5,#REF!,IF($C$2=6,#REF!,IF($C$2=8,#REF!,IF($C$2=9,#REF!,IF($C$2=\"PERU2020\",#REF!))))))))","v":false},{"$f":"IF($C$2=2,Venezuela!F303,IF($C$2=3,#REF!,IF($C$2=4,#REF!,IF($C$2=5,#REF!,IF($C$2=6,#REF!,IF($C$2=8,#REF!,IF($C$2=9,#REF!,IF($C$2=\"PERU2020\",#REF!))))))))","v":false},{"$f":"IF($C$2=2,Venezuela!G303,IF($C$2=3,#REF!,IF($C$2=4,#REF!,IF($C$2=5,#REF!,IF($C$2=6,#REF!,IF($C$2=8,#REF!,IF($C$2=9,#REF!,IF($C$2=\"PERU2020\",#REF!))))))))","v":false},{"$f":"IF($C$2=2,Venezuela!H303,IF($C$2=3,#REF!,IF($C$2=4,#REF!,IF($C$2=5,#REF!,IF($C$2=6,#REF!,IF($C$2=8,#REF!,IF($C$2=9,#REF!,IF($C$2=\"PERU2020\",#REF!))))))))","v":false},null,17.5,17.5,17.5,17.5,17.5]
[55,"55-59",null,17.5,17.5,17.5,17.5,17.5,null,null,{"$f":"IF($C$2=2,Venezuela!D304,IF($C$2=3,#REF!,IF($C$2=4,#REF!,IF($C$2=5,#REF!,IF($C$2=6,#REF!,IF($C$2=8,#REF!,IF($C$2=9,#REF!,IF($C$2=\"PERU2020\",#REF!))))))))","v":false},{"$f":"IF($C$2=2,Venezuela!E304,IF($C$2=3,#REF!,IF($C$2=4,#REF!,IF($C$2=5,#REF!,IF($C$2=6,#REF!,IF($C$2=8,#REF!,IF($C$2=9,#REF!,IF($C$2=\"PERU2020\",#REF!))))))))","v":false},{"$f":"IF($C$2=2,Venezuela!F304,IF($C$2=3,#REF!,IF($C$2=4,#REF!,IF($C$2=5,#REF!,IF($C$2=6,#REF!,IF($C$2=8,#REF!,IF($C$2=9,#REF!,IF($C$2=\"PERU2020\",#REF!))))))))","v":false},{"$f":"IF($C$2=2,Venezuela!G304,IF($C$2=3,#REF!,IF($C$2=4,#REF!,IF($C$2=5,#REF!,IF($C$2=6,#REF!,IF($C$2=8,#REF!,IF($C$2=9,#REF!,IF($C$2=\"PERU2020\",#REF!))))))))","v":false},{"$f":"IF($C$2=2,Venezuela!H304,IF($C$2=3,#REF!,IF($C$2=4,#REF!,IF($C$2=5,#REF!,IF($C$2=6,#REF!,IF($C$2=8,#REF!,IF($C$2=9,#REF!,IF($C$2=\"PERU2020\",#REF!))))))))","v":false},null,17.5,17.5,17.5,17.5,17.5]
[60,"60",null,17.5,17.5,17.5,17.5,17.5,null,null,{"$f":"IF($C$2=2,Venezuela!D305,IF($C$2=3,#REF!,IF($C$2=4,#REF!,IF($C$2=5,#REF!,IF($C$2=6,#REF!,IF($C$2=8,#REF!,IF($C$2=9,#REF!,IF($C$2=\"PERU2020\",#REF!))))))))","v":false},{"$f":"IF($C$2=2,Venezuela!E305,IF($C$2=3,#REF!,IF($C$2=4,#REF!,IF($C$2=5,#REF!,IF($C$2=6,#REF!,IF($C$2=8,#REF!,IF($C$2=9,#REF!,IF($C$2=\"PERU2020\",#REF!))))))))","v":false},{"$f":"IF($C$2=2,Venezuela!F305,IF($C$2=3,#REF!,IF($C$2=4,#REF!,IF($C$2=5,#REF!,IF($C$2=6,#REF!,IF($C$2=8,#REF!,IF($C$2=9,#REF!,IF($C$2=\"PERU2020\",#REF!))))))))","v":false},{"$f":"IF($C$2=2,Venezuela!G305,IF($C$2=3,#REF!,IF($C$2=4,#REF!,IF($C$2=5,#REF!,IF($C$2=6,#REF!,IF($C$2=8,#REF!,IF($C$2=9,#REF!,IF($C$2=\"PERU2020\",#REF!))))))))","v":false},{"$f":"IF($C$2=2,Venezuela!H305,IF($C$2=3,#REF!,IF($C$2=4,#REF!,IF($C$2=5,#REF!,IF($C$2=6,#REF!,IF($C$2=8,#REF!,IF($C$2=9,#REF!,IF($C$2=\"PERU2020\",#REF!))))))))","v":false},null,17.5,17.5,17.5,17.5,17.5]
[61,"61",null,17.5,17.5,17.5,17.5,17.5,null,null,{"$f":"IF($C$2=2,Venezuela!D306,IF($C$2=3,#REF!,IF($C$2=4,#REF!,IF($C$2=5,#REF!,IF($C$2=6,#REF!,IF($C$2=8,#REF!,IF($C$2=9,#REF!,IF($C$2=\"PERU2020\",#REF!))))))))","v":false},{"$f":"IF($C$2=2,Venezuela!E306,IF($C$2=3,#REF!,IF($C$2=4,#REF!,IF($C$2=5,#REF!,IF($C$2=6,#REF!,IF($C$2=8,#REF!,IF($C$2=9,#REF!,IF($C$2=\"PERU2020\",#REF!))))))))","v":false},{"$f":"IF($C$2=2,Venezuela!F306,IF($C$2=3,#REF!,IF($C$2=4,#REF!,IF($C$2=5,#REF!,IF($C$2=6,#REF!,IF($C$2=8,#REF!,IF($C$2=9,#REF!,IF($C$2=\"PERU2020\",#REF!))))))))","v":false},{"$f":"IF($C$2=2,Venezuela!G306,IF($C$2=3,#REF!,IF($C$2=4,#REF!,IF($C$2=5,#REF!,IF($C$2=6,#REF!,IF($C$2=8,#REF!,IF($C$2=9,#REF!,IF($C$2=\"PERU2020\",#REF!))))))))","v":false},{"$f":"IF($C$2=2,Venezuela!H306,IF($C$2=3,#REF!,IF($C$2=4,#REF!,IF($C$2=5,#REF!,IF($C$2=6,#REF!,IF($C$2=8,#REF!,IF($C$2=9,#REF!,IF($C$2=\"PERU2020\",#REF!))))))))","v":false},null,17.5,17.5,17.5,17.5,17.5]
[62,"62",null,17.5,17.5,17.5,17.5,17.5,null,null,{"$f":"IF($C$2=2,Venezuela!D307,IF($C$2=3,#REF!,IF($C$2=4,#REF!,IF($C$2=5,#REF!,IF($C$2=6,#REF!,IF($C$2=8,#REF!,IF($C$2=9,#REF!,IF($C$2=\"PERU2020\",#REF!))))))))","v":false},{"$f":"IF($C$2=2,Venezuela!E307,IF($C$2=3,#REF!,IF($C$2=4,#REF!,IF($C$2=5,#REF!,IF($C$2=6,#REF!,IF($C$2=8,#REF!,IF($C$2=9,#REF!,IF($C$2=\"PERU2020\",#REF!))))))))","v":false},{"$f":"IF($C$2=2,Venezuela!F307,IF($C$2=3,#REF!,IF($C$2=4,#REF!,IF($C$2=5,#REF!,IF($C$2=6,#REF!,IF($C$2=8,#REF!,IF($C$2=9,#REF!,IF($C$2=\"PERU2020\",#REF!))))))))","v":false},{"$f":"IF($C$2=2,Venezuela!G307,IF($C$2=3,#REF!,IF($C$2=4,#REF!,IF($C$2=5,#REF!,IF($C$2=6,#REF!,IF($C$2=8,#REF!,IF($C$2=9,#REF!,IF($C$2=\"PERU2020\",#REF!))))))))","v":false},{"$f":"IF($C$2=2,Venezuela!H307,IF($C$2=3,#REF!,IF($C$2=4,#REF!,IF($C$2=5,#REF!,IF($C$2=6,#REF!,IF($C$2=8,#REF!,IF($C$2=9,#REF!,IF($C$2=\"PERU2020\",#REF!))))))))","v":false},null,17.5,17.5,17.5,17.5,17.5]
[63,"63",null,17.5,17.5,17.5,17.5,17.5,null,null,{"$f":"IF($C$2=2,Venezuela!D308,IF($C$2=3,#REF!,IF($C$2=4,#REF!,IF($C$2=5,#REF!,IF($C$2=6,#REF!,IF($C$2=8,#REF!,IF($C$2=9,#REF!,IF($C$2=\"PERU2020\",#REF!))))))))","v":false},{"$f":"IF($C$2=2,Venezuela!E308,IF($C$2=3,#REF!,IF($C$2=4,#REF!,IF($C$2=5,#REF!,IF($C$2=6,#REF!,IF($C$2=8,#REF!,IF($C$2=9,#REF!,IF($C$2=\"PERU2020\",#REF!))))))))","v":false},{"$f":"IF($C$2=2,Venezuela!F308,IF($C$2=3,#REF!,IF($C$2=4,#REF!,IF($C$2=5,#REF!,IF($C$2=6,#REF!,IF($C$2=8,#REF!,IF($C$2=9,#REF!,IF($C$2=\"PERU2020\",#REF!))))))))","v":false},{"$f":"IF($C$2=2,Venezuela!G308,IF($C$2=3,#REF!,IF($C$2=4,#REF!,IF($C$2=5,#REF!,IF($C$2=6,#REF!,IF($C$2=8,#REF!,IF($C$2=9,#REF!,IF($C$2=\"PERU2020\",#REF!))))))))","v":false},{"$f":"IF($C$2=2,Venezuela!H308,IF($C$2=3,#REF!,IF($C$2=4,#REF!,IF($C$2=5,#REF!,IF($C$2=6,#REF!,IF($C$2=8,#REF!,IF($C$2=9,#REF!,IF($C$2=\"PERU2020\",#REF!))))))))","v":false},null,17.5,17.5,17.5,17.5,17.5]
[64,"64",null,17.5,17.5,17.5,17.5,17.5,null,null,{"$f":"IF($C$2=2,Venezuela!D309,IF($C$2=3,#REF!,IF($C$2=4,#REF!,IF($C$2=5,#REF!,IF($C$2=6,#REF!,IF($C$2=8,#REF!,IF($C$2=9,#REF!,IF($C$2=\"PERU2020\",#REF!))))))))","v":false},{"$f":"IF($C$2=2,Venezuela!E309,IF($C$2=3,#REF!,IF($C$2=4,#REF!,IF($C$2=5,#REF!,IF($C$2=6,#REF!,IF($C$2=8,#REF!,IF($C$2=9,#REF!,IF($C$2=\"PERU2020\",#REF!))))))))","v":false},{"$f":"IF($C$2=2,Venezuela!F309,IF($C$2=3,#REF!,IF($C$2=4,#REF!,IF($C$2=5,#REF!,IF($C$2=6,#REF!,IF($C$2=8,#REF!,IF($C$2=9,#REF!,IF($C$2=\"PERU2020\",#REF!))))))))","v":false},{"$f":"IF($C$2=2,Venezuela!G309,IF($C$2=3,#REF!,IF($C$2=4,#REF!,IF($C$2=5,#REF!,IF($C$2=6,#REF!,IF($C$2=8,#REF!,IF($C$2=9,#REF!,IF($C$2=\"PERU2020\",#REF!))))))))","v":false},{"$f":"IF($C$2=2,Venezuela!H309,IF($C$2=3,#REF!,IF($C$2=4,#REF!,IF($C$2=5,#REF!,IF($C$2=6,#REF!,IF($C$2=8,#REF!,IF($C$2=9,#REF!,IF($C$2=\"PERU2020\",#REF!))))))))","v":false},null,17.5,17.5,17.5,17.5,17.5]
[65,"65",null,17.5,17.5,17.5,17.5,17.5,null,null,{"$f":"IF($C$2=2,Venezuela!D310,IF($C$2=3,#REF!,IF($C$2=4,#REF!,IF($C$2=5,#REF!,IF($C$2=6,#REF!,IF($C$2=8,#REF!,IF($C$2=9,#REF!,IF($C$2=\"PERU2020\",#REF!))))))))","v":false},{"$f":"IF($C$2=2,Venezuela!E310,IF($C$2=3,#REF!,IF($C$2=4,#REF!,IF($C$2=5,#REF!,IF($C$2=6,#REF!,IF($C$2=8,#REF!,IF($C$2=9,#REF!,IF($C$2=\"PERU2020\",#REF!))))))))","v":false},{"$f":"IF($C$2=2,Venezuela!F310,IF($C$2=3,#REF!,IF($C$2=4,#REF!,IF($C$2=5,#REF!,IF($C$2=6,#REF!,IF($C$2=8,#REF!,IF($C$2=9,#REF!,IF($C$2=\"PERU2020\",#REF!))))))))","v":false},{"$f":"IF($C$2=2,Venezuela!G310,IF($C$2=3,#REF!,IF($C$2=4,#REF!,IF($C$2=5,#REF!,IF($C$2=6,#REF!,IF($C$2=8,#REF!,IF($C$2=9,#REF!,IF($C$2=\"PERU2020\",#REF!))))))))","v":false},{"$f":"IF($C$2=2,Venezuela!H310,IF($C$2=3,#REF!,IF($C$2=4,#REF!,IF($C$2=5,#REF!,IF($C$2=6,#REF!,IF($C$2=8,#REF!,IF($C$2=9,#REF!,IF($C$2=\"PERU2020\",#REF!))))))))","v":false},null,17.5,17.5,17.5,17.5,17.5]
[66,"66",null,17.5,17.5,17.5,17.5,17.5,null,null,{"$f":"IF($C$2=2,Venezuela!D311,IF($C$2=3,#REF!,IF($C$2=4,#REF!,IF($C$2=5,#REF!,IF($C$2=6,#REF!,IF($C$2=8,#REF!,IF($C$2=9,#REF!,IF($C$2=\"PERU2020\",#REF!))))))))","v":false},{"$f":"IF($C$2=2,Venezuela!E311,IF($C$2=3,#REF!,IF($C$2=4,#REF!,IF($C$2=5,#REF!,IF($C$2=6,#REF!,IF($C$2=8,#REF!,IF($C$2=9,#REF!,IF($C$2=\"PERU2020\",#REF!))))))))","v":false},{"$f":"IF($C$2=2,Venezuela!F311,IF($C$2=3,#REF!,IF($C$2=4,#REF!,IF($C$2=5,#REF!,IF($C$2=6,#REF!,IF($C$2=8,#REF!,IF($C$2=9,#REF!,IF($C$2=\"PERU2020\",#REF!))))))))","v":false},{"$f":"IF($C$2=2,Venezuela!G311,IF($C$2=3,#REF!,IF($C$2=4,#REF!,IF($C$2=5,#REF!,IF($C$2=6,#REF!,IF($C$2=8,#REF!,IF($C$2=9,#REF!,IF($C$2=\"PERU2020\",#REF!))))))))","v":false},{"$f":"IF($C$2=2,Venezuela!H311,IF($C$2=3,#REF!,IF($C$2=4,#REF!,IF($C$2=5,#REF!,IF($C$2=6,#REF!,IF($C$2=8,#REF!,IF($C$2=9,#REF!,IF($C$2=\"PERU2020\",#REF!))))))))","v":false},null,17.5,17.5,17.5,17.5,17.5]
[67,"67",null,17.5,17.5,17.5,17.5,17.5,null,null,{"$f":"IF($C$2=2,Venezuela!D312,IF($C$2=3,#REF!,IF($C$2=4,#REF!,IF($C$2=5,#REF!,IF($C$2=6,#REF!,IF($C$2=8,#REF!,IF($C$2=9,#REF!,IF($C$2=\"PERU2020\",#REF!))))))))","v":false},{"$f":"IF($C$2=2,Venezuela!E312,IF($C$2=3,#REF!,IF($C$2=4,#REF!,IF($C$2=5,#REF!,IF($C$2=6,#REF!,IF($C$2=8,#REF!,IF($C$2=9,#REF!,IF($C$2=\"PERU2020\",#REF!))))))))","v":false},{"$f":"IF($C$2=2,Venezuela!F312,IF($C$2=3,#REF!,IF($C$2=4,#REF!,IF($C$2=5,#REF!,IF($C$2=6,#REF!,IF($C$2=8,#REF!,IF($C$2=9,#REF!,IF($C$2=\"PERU2020\",#REF!))))))))","v":false},{"$f":"IF($C$2=2,Venezuela!G312,IF($C$2=3,#REF!,IF($C$2=4,#REF!,IF($C$2=5,#REF!,IF($C$2=6,#REF!,IF($C$2=8,#REF!,IF($C$2=9,#REF!,IF($C$2=\"PERU2020\",#REF!))))))))","v":false},{"$f":"IF($C$2=2,Venezuela!H312,IF($C$2=3,#REF!,IF($C$2=4,#REF!,IF($C$2=5,#REF!,IF($C$2=6,#REF!,IF($C$2=8,#REF!,IF($C$2=9,#REF!,IF($C$2=\"PERU2020\",#REF!))))))))","v":false},null,17.5,17.5,17.5,17.5,17.5]
[68,"68",null,17.5,17.5,17.5,17.5,17.5,null,null,{"$f":"IF($C$2=2,Venezuela!D313,IF($C$2=3,#REF!,IF($C$2=4,#REF!,IF($C$2=5,#REF!,IF($C$2=6,#REF!,IF($C$2=8,#REF!,IF($C$2=9,#REF!,IF($C$2=\"PERU2020\",#REF!))))))))","v":false},{"$f":"IF($C$2=2,Venezuela!E313,IF($C$2=3,#REF!,IF($C$2=4,#REF!,IF($C$2=5,#REF!,IF($C$2=6,#REF!,IF($C$2=8,#REF!,IF($C$2=9,#REF!,IF($C$2=\"PERU2020\",#REF!))))))))","v":false},{"$f":"IF($C$2=2,Venezuela!F313,IF($C$2=3,#REF!,IF($C$2=4,#REF!,IF($C$2=5,#REF!,IF($C$2=6,#REF!,IF($C$2=8,#REF!,IF($C$2=9,#REF!,IF($C$2=\"PERU2020\",#REF!))))))))","v":false},{"$f":"IF($C$2=2,Venezuela!G313,IF($C$2=3,#REF!,IF($C$2=4,#REF!,IF($C$2=5,#REF!,IF($C$2=6,#REF!,IF($C$2=8,#REF!,IF($C$2=9,#REF!,IF($C$2=\"PERU2020\",#REF!))))))))","v":false},{"$f":"IF($C$2=2,Venezuela!H313,IF($C$2=3,#REF!,IF($C$2=4,#REF!,IF($C$2=5,#REF!,IF($C$2=6,#REF!,IF($C$2=8,#REF!,IF($C$2=9,#REF!,IF($C$2=\"PERU2020\",#REF!))))))))","v":false},null,17.5,17.5,17.5,17.5,17.5]
[69,"69",null,17.5,17.5,17.5,17.5,17.5,null,null,{"$f":"IF($C$2=2,Venezuela!D314,IF($C$2=3,#REF!,IF($C$2=4,#REF!,IF($C$2=5,#REF!,IF($C$2=6,#REF!,IF($C$2=8,#REF!,IF($C$2=9,#REF!,IF($C$2=\"PERU2020\",#REF!))))))))","v":false},{"$f":"IF($C$2=2,Venezuela!E314,IF($C$2=3,#REF!,IF($C$2=4,#REF!,IF($C$2=5,#REF!,IF($C$2=6,#REF!,IF($C$2=8,#REF!,IF($C$2=9,#REF!,IF($C$2=\"PERU2020\",#REF!))))))))","v":false},{"$f":"IF($C$2=2,Venezuela!F314,IF($C$2=3,#REF!,IF($C$2=4,#REF!,IF($C$2=5,#REF!,IF($C$2=6,#REF!,IF($C$2=8,#REF!,IF($C$2=9,#REF!,IF($C$2=\"PERU2020\",#REF!))))))))","v":false},{"$f":"IF($C$2=2,Venezuela!G314,IF($C$2=3,#REF!,IF($C$2=4,#REF!,IF($C$2=5,#REF!,IF($C$2=6,#REF!,IF($C$2=8,#REF!,IF($C$2=9,#REF!,IF($C$2=\"PERU2020\",#REF!))))))))","v":false},{"$f":"IF($C$2=2,Venezuela!H314,IF($C$2=3,#REF!,IF($C$2=4,#REF!,IF($C$2=5,#REF!,IF($C$2=6,#REF!,IF($C$2=8,#REF!,IF($C$2=9,#REF!,IF($C$2=\"PERU2020\",#REF!))))))))","v":false},null,17.5,17.5,17.5,17.5,17.5]
[70,"70",null,17.5,17.5,17.5,17.5,17.5,null,null,{"$f":"IF($C$2=2,Venezuela!D315,IF($C$2=3,#REF!,IF($C$2=4,#REF!,IF($C$2=5,#REF!,IF($C$2=6,#REF!,IF($C$2=8,#REF!,IF($C$2=9,#REF!,IF($C$2=\"PERU2020\",#REF!))))))))","v":false},{"$f":"IF($C$2=2,Venezuela!E315,IF($C$2=3,#REF!,IF($C$2=4,#REF!,IF($C$2=5,#REF!,IF($C$2=6,#REF!,IF($C$2=8,#REF!,IF($C$2=9,#REF!,IF($C$2=\"PERU2020\",#REF!))))))))","v":false},{"$f":"IF($C$2=2,Venezuela!F315,IF($C$2=3,#REF!,IF($C$2=4,#REF!,IF($C$2=5,#REF!,IF($C$2=6,#REF!,IF($C$2=8,#REF!,IF($C$2=9,#REF!,IF($C$2=\"PERU2020\",#REF!))))))))","v":false},{"$f":"IF($C$2=2,Venezuela!G315,IF($C$2=3,#REF!,IF($C$2=4,#REF!,IF($C$2=5,#REF!,IF($C$2=6,#REF!,IF($C$2=8,#REF!,IF($C$2=9,#REF!,IF($C$2=\"PERU2020\",#REF!))))))))","v":false},{"$f":"IF($C$2=2,Venezuela!H315,IF($C$2=3,#REF!,IF($C$2=4,#REF!,IF($C$2=5,#REF!,IF($C$2=6,#REF!,IF($C$2=8,#REF!,IF($C$2=9,#REF!,IF($C$2=\"PERU2020\",#REF!))))))))","v":false},null,17.5,17.5,17.5,17.5,17.5]
[71,"71",null,17.5,17.5,17.5,17.5,17.5,null,null,{"$f":"IF($C$2=2,Venezuela!D316,IF($C$2=3,#REF!,IF($C$2=4,#REF!,IF($C$2=5,#REF!,IF($C$2=6,#REF!,IF($C$2=8,#REF!,IF($C$2=9,#REF!,IF($C$2=\"PERU2020\",#REF!))))))))","v":false},{"$f":"IF($C$2=2,Venezuela!E316,IF($C$2=3,#REF!,IF($C$2=4,#REF!,IF($C$2=5,#REF!,IF($C$2=6,#REF!,IF($C$2=8,#REF!,IF($C$2=9,#REF!,IF($C$2=\"PERU2020\",#REF!))))))))","v":false},{"$f":"IF($C$2=2,Venezuela!F316,IF($C$2=3,#REF!,IF($C$2=4,#REF!,IF($C$2=5,#REF!,IF($C$2=6,#REF!,IF($C$2=8,#REF!,IF($C$2=9,#REF!,IF($C$2=\"PERU2020\",#REF!))))))))","v":false},{"$f":"IF($C$2=2,Venezuela!G316,IF($C$2=3,#REF!,IF($C$2=4,#REF!,IF($C$2=5,#REF!,IF($C$2=6,#REF!,IF($C$2=8,#REF!,IF($C$2=9,#REF!,IF($C$2=\"PERU2020\",#REF!))))))))","v":false},{"$f":"IF($C$2=2,Venezuela!H316,IF($C$2=3,#REF!,IF($C$2=4,#REF!,IF($C$2=5,#REF!,IF($C$2=6,#REF!,IF($C$2=8,#REF!,IF($C$2=9,#REF!,IF($C$2=\"PERU2020\",#REF!))))))))","v":false},null,17.5,17.5,17.5,17.5,17.5]
[72,"72",null,17.5,17.5,17.5,17.5,17.5,null,null,{"$f":"IF($C$2=2,Venezuela!D317,IF($C$2=3,#REF!,IF($C$2=4,#REF!,IF($C$2=5,#REF!,IF($C$2=6,#REF!,IF($C$2=8,#REF!,IF($C$2=9,#REF!,IF($C$2=\"PERU2020\",#REF!))))))))","v":false},{"$f":"IF($C$2=2,Venezuela!E317,IF($C$2=3,#REF!,IF($C$2=4,#REF!,IF($C$2=5,#REF!,IF($C$2=6,#REF!,IF($C$2=8,#REF!,IF($C$2=9,#REF!,IF($C$2=\"PERU2020\",#REF!))))))))","v":false},{"$f":"IF($C$2=2,Venezuela!F317,IF($C$2=3,#REF!,IF($C$2=4,#REF!,IF($C$2=5,#REF!,IF($C$2=6,#REF!,IF($C$2=8,#REF!,IF($C$2=9,#REF!,IF($C$2=\"PERU2020\",#REF!))))))))","v":false},{"$f":"IF($C$2=2,Venezuela!G317,IF($C$2=3,#REF!,IF($C$2=4,#REF!,IF($C$2=5,#REF!,IF($C$2=6,#REF!,IF($C$2=8,#REF!,IF($C$2=9,#REF!,IF($C$2=\"PERU2020\",#REF!))))))))","v":false},{"$f":"IF($C$2=2,Venezuela!H317,IF($C$2=3,#REF!,IF($C$2=4,#REF!,IF($C$2=5,#REF!,IF($C$2=6,#REF!,IF($C$2=8,#REF!,IF($C$2=9,#REF!,IF($C$2=\"PERU2020\",#REF!))))))))","v":false},null,17.5,17.5,17.5,17.5,17.5]
[73,"73",null,17.5,17.5,17.5,17.5,17.5,null,null,{"$f":"IF($C$2=2,Venezuela!D318,IF($C$2=3,#REF!,IF($C$2=4,#REF!,IF($C$2=5,#REF!,IF($C$2=6,#REF!,IF($C$2=8,#REF!,IF($C$2=9,#REF!,IF($C$2=\"PERU2020\",#REF!))))))))","v":false},{"$f":"IF($C$2=2,Venezuela!E318,IF($C$2=3,#REF!,IF($C$2=4,#REF!,IF($C$2=5,#REF!,IF($C$2=6,#REF!,IF($C$2=8,#REF!,IF($C$2=9,#REF!,IF($C$2=\"PERU2020\",#REF!))))))))","v":false},{"$f":"IF($C$2=2,Venezuela!F318,IF($C$2=3,#REF!,IF($C$2=4,#REF!,IF($C$2=5,#REF!,IF($C$2=6,#REF!,IF($C$2=8,#REF!,IF($C$2=9,#REF!,IF($C$2=\"PERU2020\",#REF!))))))))","v":false},{"$f":"IF($C$2=2,Venezuela!G318,IF($C$2=3,#REF!,IF($C$2=4,#REF!,IF($C$2=5,#REF!,IF($C$2=6,#REF!,IF($C$2=8,#REF!,IF($C$2=9,#REF!,IF($C$2=\"PERU2020\",#REF!))))))))","v":false},{"$f":"IF($C$2=2,Venezuela!H318,IF($C$2=3,#REF!,IF($C$2=4,#REF!,IF($C$2=5,#REF!,IF($C$2=6,#REF!,IF($C$2=8,#REF!,IF($C$2=9,#REF!,IF($C$2=\"PERU2020\",#REF!))))))))","v":false},null,17.5,17.5,17.5,17.5,17.5]
[74,"74",null,17.5,17.5,17.5,17.5,17.5,null,null,{"$f":"IF($C$2=2,Venezuela!D319,IF($C$2=3,#REF!,IF($C$2=4,#REF!,IF($C$2=5,#REF!,IF($C$2=6,#REF!,IF($C$2=8,#REF!,IF($C$2=9,#REF!,IF($C$2=\"PERU2020\",#REF!))))))))","v":false},{"$f":"IF($C$2=2,Venezuela!E319,IF($C$2=3,#REF!,IF($C$2=4,#REF!,IF($C$2=5,#REF!,IF($C$2=6,#REF!,IF($C$2=8,#REF!,IF($C$2=9,#REF!,IF($C$2=\"PERU2020\",#REF!))))))))","v":false},{"$f":"IF($C$2=2,Venezuela!F319,IF($C$2=3,#REF!,IF($C$2=4,#REF!,IF($C$2=5,#REF!,IF($C$2=6,#REF!,IF($C$2=8,#REF!,IF($C$2=9,#REF!,IF($C$2=\"PERU2020\",#REF!))))))))","v":false},{"$f":"IF($C$2=2,Venezuela!G319,IF($C$2=3,#REF!,IF($C$2=4,#REF!,IF($C$2=5,#REF!,IF($C$2=6,#REF!,IF($C$2=8,#REF!,IF($C$2=9,#REF!,IF($C$2=\"PERU2020\",#REF!))))))))","v":false},{"$f":"IF($C$2=2,Venezuela!H319,IF($C$2=3,#REF!,IF($C$2=4,#REF!,IF($C$2=5,#REF!,IF($C$2=6,#REF!,IF($C$2=8,#REF!,IF($C$2=9,#REF!,IF($C$2=\"PERU2020\",#REF!))))))))","v":false},null,17.5,17.5,17.5,17.5,17.5]
[75,"75+",null,17.5,17.5,17.5,17.5,17.5,null,null,{"$f":"IF($C$2=2,Venezuela!D320,IF($C$2=3,#REF!,IF($C$2=4,#REF!,IF($C$2=5,#REF!,IF($C$2=6,#REF!,IF($C$2=8,#REF!,IF($C$2=9,#REF!,IF($C$2=\"PERU2020\",#REF!))))))))","v":false},{"$f":"IF($C$2=2,Venezuela!E320,IF($C$2=3,#REF!,IF($C$2=4,#REF!,IF($C$2=5,#REF!,IF($C$2=6,#REF!,IF($C$2=8,#REF!,IF($C$2=9,#REF!,IF($C$2=\"PERU2020\",#REF!))))))))","v":false},{"$f":"IF($C$2=2,Venezuela!F320,IF($C$2=3,#REF!,IF($C$2=4,#REF!,IF($C$2=5,#REF!,IF($C$2=6,#REF!,IF($C$2=8,#REF!,IF($C$2=9,#REF!,IF($C$2=\"PERU2020\",#REF!))))))))","v":false},{"$f":"IF($C$2=2,Venezuela!G320,IF($C$2=3,#REF!,IF($C$2=4,#REF!,IF($C$2=5,#REF!,IF($C$2=6,#REF!,IF($C$2=8,#REF!,IF($C$2=9,#REF!,IF($C$2=\"PERU2020\",#REF!))))))))","v":false},{"$f":"IF($C$2=2,Venezuela!H320,IF($C$2=3,#REF!,IF($C$2=4,#REF!,IF($C$2=5,#REF!,IF($C$2=6,#REF!,IF($C$2=8,#REF!,IF($C$2=9,#REF!,IF($C$2=\"PERU2020\",#REF!))))))))","v":false},null,17.5,17.5,17.5,17.5,17.5]
[1,"1 Child",null,0,0,0,0,0,null,null,{"$f":"IF($C$2=2,Venezuela!D321,IF($C$2=3,#REF!,IF($C$2=4,#REF!,IF($C$2=5,#REF!,IF($C$2=6,#REF!,IF($C$2=8,#REF!,IF($C$2=9,#REF!,IF($C$2=\"PERU2020\",#REF!))))))))","v":false},{"$f":"IF($C$2=2,Venezuela!E321,IF($C$2=3,#REF!,IF($C$2=4,#REF!,IF($C$2=5,#REF!,IF($C$2=6,#REF!,IF($C$2=8,#REF!,IF($C$2=9,#REF!,IF($C$2=\"PERU2020\",#REF!))))))))","v":false},{"$f":"IF($C$2=2,Venezuela!F321,IF($C$2=3,#REF!,IF($C$2=4,#REF!,IF($C$2=5,#REF!,IF($C$2=6,#REF!,IF($C$2=8,#REF!,IF($C$2=9,#REF!,IF($C$2=\"PERU2020\",#REF!))))))))","v":false},{"$f":"IF($C$2=2,Venezuela!G321,IF($C$2=3,#REF!,IF($C$2=4,#REF!,IF($C$2=5,#REF!,IF($C$2=6,#REF!,IF($C$2=8,#REF!,IF($C$2=9,#REF!,IF($C$2=\"PERU2020\",#REF!))))))))","v":false},{"$f":"IF($C$2=2,Venezuela!H321,IF($C$2=3,#REF!,IF($C$2=4,#REF!,IF($C$2=5,#REF!,IF($C$2=6,#REF!,IF($C$2=8,#REF!,IF($C$2=9,#REF!,IF($C$2=\"PERU2020\",#REF!))))))))","v":false},null,{"$f":"(K321)*$N$2","v":0},{"$f":"(L321)*$N$2","v":0},0,0,0]
[2,"2 Children",null,0,0,0,0,0,null,null,{"$f":"IF($C$2=2,Venezuela!D322,IF($C$2=3,#REF!,IF($C$2=4,#REF!,IF($C$2=5,#REF!,IF($C$2=6,#REF!,IF($C$2=8,#REF!,IF($C$2=9,#REF!,IF($C$2=\"PERU2020\",#REF!))))))))","v":false},{"$f":"IF($C$2=2,Venezuela!E322,IF($C$2=3,#REF!,IF($C$2=4,#REF!,IF($C$2=5,#REF!,IF($C$2=6,#REF!,IF($C$2=8,#REF!,IF($C$2=9,#REF!,IF($C$2=\"PERU2020\",#REF!))))))))","v":false},{"$f":"IF($C$2=2,Venezuela!F322,IF($C$2=3,#REF!,IF($C$2=4,#REF!,IF($C$2=5,#REF!,IF($C$2=6,#REF!,IF($C$2=8,#REF!,IF($C$2=9,#REF!,IF($C$2=\"PERU2020\",#REF!))))))))","v":false},{"$f":"IF($C$2=2,Venezuela!G322,IF($C$2=3,#REF!,IF($C$2=4,#REF!,IF($C$2=5,#REF!,IF($C$2=6,#REF!,IF($C$2=8,#REF!,IF($C$2=9,#REF!,IF($C$2=\"PERU2020\",#REF!))))))))","v":false},{"$f":"IF($C$2=2,Venezuela!H322,IF($C$2=3,#REF!,IF($C$2=4,#REF!,IF($C$2=5,#REF!,IF($C$2=6,#REF!,IF($C$2=8,#REF!,IF($C$2=9,#REF!,IF($C$2=\"PERU2020\",#REF!))))))))","v":false},null,{"$f":"(K322)*$N$2","v":0},{"$f":"(L322)*$N$2","v":0},{"$f":"(M322)*$N$2","v":0},{"$f":"(N322)*$N$2","v":0},{"$f":"(O322)*$N$2","v":0}]
[3,"3+ Children",null,0,0,0,0,0,null,null,{"$f":"IF($C$2=2,Venezuela!D323,IF($C$2=3,#REF!,IF($C$2=4,#REF!,IF($C$2=5,#REF!,IF($C$2=6,#REF!,IF($C$2=8,#REF!,IF($C$2=9,#REF!,IF($C$2=\"PERU2020\",#REF!))))))))","v":false},{"$f":"IF($C$2=2,Venezuela!E323,IF($C$2=3,#REF!,IF($C$2=4,#REF!,IF($C$2=5,#REF!,IF($C$2=6,#REF!,IF($C$2=8,#REF!,IF($C$2=9,#REF!,IF($C$2=\"PERU2020\",#REF!))))))))","v":false},{"$f":"IF($C$2=2,Venezuela!F323,IF($C$2=3,#REF!,IF($C$2=4,#REF!,IF($C$2=5,#REF!,IF($C$2=6,#REF!,IF($C$2=8,#REF!,IF($C$2=9,#REF!,IF($C$2=\"PERU2020\",#REF!))))))))","v":false},{"$f":"IF($C$2=2,Venezuela!G323,IF($C$2=3,#REF!,IF($C$2=4,#REF!,IF($C$2=5,#REF!,IF($C$2=6,#REF!,IF($C$2=8,#REF!,IF($C$2=9,#REF!,IF($C$2=\"PERU2020\",#REF!))))))))","v":false},{"$f":"IF($C$2=2,Venezuela!H323,IF($C$2=3,#REF!,IF($C$2=4,#REF!,IF($C$2=5,#REF!,IF($C$2=6,#REF!,IF($C$2=8,#REF!,IF($C$2=9,#REF!,IF($C$2=\"PERU2020\",#REF!))))))))","v":false},null,0,0,0,0,0]
[1,"Rider Comp. Maternidad",null,225,225,225,225,225]
[1,"Transplante de organos",null,300,300,300,300,300]
[]
[]
[]
["TARIFAS SEMESTRALES "]
["EDAD"]
[" "," ",null,"AW2","AW3","AW4","AW5","AW6"]
[18,"18-24",null,{"$f":"+D297*$G$2","v":9.2750000000000004},9.2750000000000004,9.2750000000000004,9.2750000000000004,9.2750000000000004]
[25,"25-29",null,9.2750000000000004,9.2750000000000004,9.2750000000000004,9.2750000000000004,9.2750000000000004]
[30,"30-34",null,9.2750000000000004,9.2750000000000004,9.2750000000000004,9.2750000000000004,9.2750000000000004]
[35,"35-39",null,9.2750000000000004,9.2750000000000004,9.2750000000000004,9.2750000000000004,9.2750000000000004]
[40,"40-44",null,9.2750000000000004,9.2750000000000004,9.2750000000000004,9.2750000000000004,9.2750000000000004]
[45,"45-49",null,9.2750000000000004,9.2750000000000004,9.2750000000000004,9.2750000000000004,9.2750000000000004]
[50,"50-54",null,9.2750000000000004,9.2750000000000004,9.2750000000000004,9.2750000000000004,9.2750000000000004]
[55,"55-59",null,9.2750000000000004,9.2750000000000004,9.2750000000000004,9.2750000000000004,9.2750000000000004]
[60,"60",null,9.2750000000000004,9.2750000000000004,9.2750000000000004,9.2750000000000004,9.2750000000000004]
[61,"61",null,9.2750000000000004,9.2750000000000004,9.2750000000000004,9.2750000000000004,9.2750000000000004]
[62,"62",null,{"$f":"+D307*$G$2","v":9.2750000000000004},9.2750000000000004,9.2750000000000004,9.2750000000000004,9.2750000000000004]
[63,"63",null,9.2750000000000004,9.2750000000000004,9.2750000000000004,9.2750000000000004,9.2750000000000004]
[64,"64",null,9.2750000000000004,9.2750000000000004,9.2750000000000004,9.2750000000000004,9.2750000000000004]
[65,"65",null,9.2750000000000004,9.2750000000000004,9.2750000000000004,9.2750000000000004,9.2750000000000004]
[66,"66",null,9.2750000000000004,9.2750000000000004,9.2750000000000004,9.2750000000000004,9.2750000000000004]
[67,"67",null,9.2750000000000004,9.2750000000000004,9.2750000000000004,9.2750000000000004,9.2750000000000004]
[68,"68",null,9.2750000000000004,9.2750000000000004,9.2750000000000004,9.2750000000000004,9.2750000000000004]
[69,"69",null,9.2750000000000004,9.2750000000000004,9.2750000000000004,9.2750000000000004,9.2750000000000004]
[70,"70",null,9.2750000000000004,9.2750000000000004,9.2750000000000004,9.2750000000000004,9.2750000000000004]
[71,"71",null,9.2750000000000004,9.2750000000000004,9.2750000000000004,9.2750000000000004,9.2750000000000004]
[72,"72",null,{"$f":"+D317*$G$2","v":9.2750000000000004},9.2750000000000004,9.2750000000000004,9.2750000000000004,9.2750000000000004]
[73,"73",null,9.2750000000000004,9.2750000000000004,9.2750000000000004,9.2750000000000004,9.2750000000000004]
[74,"74",null,9.2750000000000004,9.2750000000000004,9.2750000000000004,9.2750000000000004,9.2750000000000004]
[75,"75+",null,9.2750000000000004,9.2750000000000004,9.2750000000000004,9.2750000000000004,9.2750000000000004]
[1,"1 Child",null,0,0,0,0,0]
[2,"2 Children",null,0,0,0,0,0]
[3,"3+ Children",null,0,0,0,0,0]
[1,"Rider Comp. Maternidad",null,119.25,119.25,119.25,119.25,119.25]
[1,"Transplante de organos",null,159,159,159,159,159]
[]
[]
[]
[]
[]
["ADVANTAGE (LATINAMERICA ONLY)"]
["TARIFAS ANUALES"]
["EDAD"]
[" "," ",null,"AL2","AL3","AL4","AL5","AL6"]
[18,"18-24",null,11240,8450,6003,4521,3578]
[25,"25-29",null,12522,9432,6676,5046,3960]
[30,"30-34",null,14491,11087,7953,5984,4611]
[35,"35-39",null,16068,12342,8853,6822,5116]
[40,"40-44",null,18135,13999,10040,7628,5791]
[45,"45-49",null,21074,16127,11319,8682,6734]
[50,"50-54",null,23095,18131,13196,9747,7397]
[55,"55-59",null,27290,20932,14596,11305,8747]
[60,"60",null,30152,23179,16056,12465,9685]
[61,"61",null,33942,26076,18072,14038,10913]
[62,"62",null,37722,29010,20091,15611,12132]
[63,"63",null,41505,31913,22117,17178,13360]
[64,"64",null,45292,34829,24140,18760,14569]
[65,"65",null,48973,37903,26303,20431,16582]
[66,"66",null,51857,40135,27861,21635,17581]
[67,"67",null,57634,44613,30968,24062,19536]
[68,"68",null,63406,49074,34077,26482,21499]
[69,"69",null,66294,51314,35619,27680,22488]
[70,"70",null,67143,52135,36169,28205,22786]
[71,"71",null,75557,58666,40705,31745,25636]
[72,"72",null,83973,65215,45242,35276,28498]
[73,"73",null,92378,71746,49775,38821,31358]
[74,"74",null,100789,78269,54304,42358,34218]
[75,"75+",null,110253,87280,62287,46373,39262]
[1,"1 Child",null,5009,3572,2624,2281,1656]
[2,"2 Children",null,8181,5634,4146,3620,2438]
[3,"3+ Children",null,11967,8220,6057,5241,3690]
[1,"Rider Comp. Maternidad"]
[1,"Transplante de organos"]
[]
["TARIFAS SEMESTRALES "]
["EDAD"]
[" "," ",null,"AL2","AL3","AL4","AL5","AL6"]
[18,"18-24",null,{"$f":"+D370*$G$2","v":5957.2000000000007},4478.5,3181.59,2396.13,1896.3400000000001]
[25,"25-29",null,6636.6600000000008,4998.96,3538.28,2674.38,2098.8000000000002]
[30,"30-34",null,7680.2300000000005,5876.1100000000006,4215.09,3171.52,2443.83]
[35,"35-39",null,8516.0400000000009,6541.26,4692.09,3615.6600000000003,2711.48]
[40,"40-44",null,9611.5500000000011,7419.47,5321.2,4042.84,3069.23]
[45,"45-49",null,11169.220000000001,8547.3100000000013,5999.0700000000006,4601.46,3569.02]
[50,"50-54",null,12240.35,9609.43,6993.88,5165.91,3920.4100000000003]
[55,"55-59",null,14463.7,11093.960000000001,7735.88,5991.6500000000005,4635.91]
[60,"60",null,15980.560000000001,12284.87,8509.68,6606.4500000000007,5133.05]
[61,"61",null,17989.260000000002,13820.28,9578.16,7440.14,5783.89]
[62,"62",null,{"$f":"+D380*$G$2","v":19992.66},15375.300000000001,10648.230000000001,8273.83,6429.96]
[63,"63",null,21997.65,16913.89,11722.01,9104.34,7080.8]
[64,"64",null,24004.760000000002,18459.370000000003,12794.2,9942.8000000000011,7721.5700000000006]
[65,"65",null,25955.690000000002,20088.59,13940.59,10828.43,8788.4600000000009]
[66,"66",null,27484.210000000003,21271.55,14766.33,11466.550000000001,9317.93]
[67,"67",null,30546.02,23644.89,16413.04,12752.86,10354.08]
[68,"68",null,33605.18,26009.22,18060.810000000001,14035.460000000001,11394.470000000001]
[69,"69",null,35135.82,27196.420000000002,18878.07,14670.400000000001,11918.640000000001]
[70,"70",null,35585.79,27631.550000000003,19169.57,14948.650000000001,12076.58]
[71,"71",null,40045.21,31092.980000000003,21573.65,16824.850000000002,13587.08]
[72,"72",null,{"$f":"+D390*$G$2","v":44505.69},34563.950000000004,23978.260000000002,18696.280000000002,15103.94]
[73,"73",null,48960.340000000004,38025.380000000005,26380.75,20575.13,16619.740000000002]
[74,"74",null,53418.170000000006,41482.57,28781.120000000003,22449.74,18135.54]
[75,"75+",null,58434.090000000004,46258.400000000001,33012.11,24577.690000000002,20808.86]
[1,"1 Child",null,2654.77,1893.16,1390.72,1208.93,877.68000000000006]
[2,"2 Children",null,4335.93,2986.02,2197.38,1918.6000000000001,1292.1400000000001]
[3,"3+ Children",null,6342.51,4356.6000000000004,3210.21,2777.73,1955.7]
[1,"Rider Comp. Maternidad",null,0,0,0,0,0]
[1,"Transplante de organos",null,0,0,0,0,0]
[]
[]
[]
[]
["BUPA SECURE CARE"]
["TARIFAS ANUALES"]
["EDAD"]
[" "," ",null,"SE2","SE3","SE4","SE5","SE6"]
[18,"18-24",null,{"$f":"Q440","v":1171.9000000000001},{"$f":"R440","v":838.45},727.95,560.25,17.5,null,null,{"$f":"Venezuela!D440","v":1776},{"$f":"Venezuela!E440","v":1263},{"$f":"Venezuela!F440","v":1093},{"$f":"Venezuela!G440","v":835},{"$f":"Venezuela!H440","v":0},null,{"$f":"(K440-50)*$O$2+50","v":1171.9000000000001},{"$f":"(L440-50)*$O$2+50","v":838.45},727.95,560.25,17.5]
[25,"25-29",null,{"$f":"Q441","v":1302.55},{"$f":"R441","v":932.05000000000007},{"$f":"S441","v":807.9},{"$f":"T441","v":617.45000000000005},{"$f":"U441","v":17.5},null,null,{"$f":"Venezuela!D441","v":1977},{"$f":"Venezuela!E441","v":1407},{"$f":"Venezuela!F441","v":1216},{"$f":"Venezuela!G441","v":923},{"$f":"Venezuela!H441","v":0},null,{"$f":"(K441-50)*$O$2+50","v":1302.55},{"$f":"(L441-50)*$O$2+50","v":932.05000000000007},{"$f":"(M441-50)*$O$2+50","v":807.9},{"$f":"(N441-50)*$O$2+50","v":617.45000000000005},{"$f":"(O441-50)*$O$2+50","v":17.5}]
[30,"30-34",null,1510.55,1078.95,937.25,713,17.5,null,null,{"$f":"Venezuela!D442","v":2297},{"$f":"Venezuela!E442","v":1633},{"$f":"Venezuela!F442","v":1415},{"$f":"Venezuela!G442","v":1070},{"$f":"Venezuela!H442","v":0},null,1510.55,1078.95,937.25,713,17.5]
[35,"35-39",null,1676.3,1196.6000000000001,1037.3499999999999,789.7,17.5,null,null,{"$f":"Venezuela!D443","v":2552},{"$f":"Venezuela!E443","v":1814},{"$f":"Venezuela!F443","v":1569},{"$f":"Venezuela!G443","v":1188},{"$f":"Venezuela!H443","v":0},null,1676.3,1196.6000000000001,1037.3499999999999,789.7,17.5]
[40,"40-44",null,1892.75,1350.65,1173.8500000000001,884.6,17.5,null,null,{"$f":"Venezuela!D444","v":2885},{"$f":"Venezuela!E444","v":2051},{"$f":"Venezuela!F444","v":1779},{"$f":"Venezuela!G444","v":1334},{"$f":"Venezuela!H444","v":0},null,1892.75,1350.65,1173.8500000000001,884.6,17.5]
[45,"45-49",null,2198.9,1569.05,1357.15,1028.25,17.5,null,null,{"$f":"Venezuela!D445","v":3356},{"$f":"Venezuela!E445","v":2387},{"$f":"Venezuela!F445","v":2061},{"$f":"Venezuela!G445","v":1555},{"$f":"Venezuela!H445","v":0},null,2198.9,1569.05,1357.15,1028.25,17.5]
[50,"50-54",null,2412.1,1719.8500000000001,1489.75,1119.9000000000001,17.5,null,null,{"$f":"Venezuela!D446","v":3684},{"$f":"Venezuela!E446","v":2619},{"$f":"Venezuela!F446","v":2265},{"$f":"Venezuela!G446","v":1696},{"$f":"Venezuela!H446","v":0},null,2412.1,1719.8500000000001,1489.75,1119.9000000000001,17.5]
[55,"55-59",null,2854.75,2034.45,1758.8500000000001,1323.3500000000001,17.5,null,null,{"$f":"Venezuela!D447","v":4365},{"$f":"Venezuela!E447","v":3103},{"$f":"Venezuela!F447","v":2679},{"$f":"Venezuela!G447","v":2009},{"$f":"Venezuela!H447","v":0},null,2854.75,2034.45,1758.8500000000001,1323.3500000000001,17.5]
[60,"60",null,3024.4,2154.7000000000003,1863.5,1396.8,17.5,null,null,{"$f":"Venezuela!D448","v":4626},{"$f":"Venezuela!E448","v":3288},{"$f":"Venezuela!F448","v":2840},{"$f":"Venezuela!G448","v":2122},{"$f":"Venezuela!H448","v":0},null,3024.4,2154.7000000000003,1863.5,1396.8,17.5]
[61,"61",null,3401.4,2422.5,2094.25,1571.65,17.5,null,null,{"$f":"Venezuela!D449","v":5206},{"$f":"Venezuela!E449","v":3700},{"$f":"Venezuela!F449","v":3195},{"$f":"Venezuela!G449","v":2391},{"$f":"Venezuela!H449","v":0},null,3401.4,2422.5,2094.25,1571.65,17.5]
[62,"62",null,3777.75,2690.3,2326.3000000000002,1746.5,17.5,null,null,{"$f":"Venezuela!D450","v":5785},{"$f":"Venezuela!E450","v":4112},{"$f":"Venezuela!F450","v":3552},{"$f":"Venezuela!G450","v":2660},{"$f":"Venezuela!H450","v":0},null,3777.75,2690.3,2326.3000000000002,1746.5,17.5]
[63,"63",null,4158,2961.35,2557.7000000000003,1921.3500000000001,17.5,null,null,{"$f":"Venezuela!D451","v":6370},{"$f":"Venezuela!E451","v":4529},{"$f":"Venezuela!F451","v":3908},{"$f":"Venezuela!G451","v":2929},{"$f":"Venezuela!H451","v":0},null,4158,2961.35,2557.7000000000003,1921.3500000000001,17.5]
[64,"64",null,4533.05,3227.2000000000003,2792.35,2094.25,17.5,null,null,{"$f":"Venezuela!D452","v":6947},{"$f":"Venezuela!E452","v":4938},{"$f":"Venezuela!F452","v":4269},{"$f":"Venezuela!G452","v":3195},{"$f":"Venezuela!H452","v":0},null,4533.05,3227.2000000000003,2792.35,2094.25,17.5]
[65,"65",null,4563.6000000000004,3248.65,2806.65,2103.35,17.5,null,null,{"$f":"Venezuela!D453","v":6994},{"$f":"Venezuela!E453","v":4971},{"$f":"Venezuela!F453","v":4291},{"$f":"Venezuela!G453","v":3209},{"$f":"Venezuela!H453","v":0},null,4563.6000000000004,3248.65,2806.65,2103.35,17.5]
[66,"66",null,4588.3,3266.2000000000003,2820.9500000000003,2110.5,17.5,null,null,{"$f":"Venezuela!D454","v":7032},{"$f":"Venezuela!E454","v":4998},{"$f":"Venezuela!F454","v":4313},{"$f":"Venezuela!G454","v":3220},{"$f":"Venezuela!H454","v":0},null,4588.3,3266.2000000000003,2820.9500000000003,2110.5,17.5]
[67,"67",null,5101.1500000000005,3632.15,3134.25,2345.8000000000002,17.5,null,null,{"$f":"Venezuela!D455","v":7821},{"$f":"Venezuela!E455","v":5561},{"$f":"Venezuela!F455","v":4795},{"$f":"Venezuela!G455","v":3582},{"$f":"Venezuela!H455","v":0},null,5101.1500000000005,3632.15,3134.25,2345.8000000000002,17.5]
[68,"68",null,5608.1500000000005,3992.25,3447.55,2580.4500000000003,17.5,null,null,{"$f":"Venezuela!D456","v":8601},{"$f":"Venezuela!E456","v":6115},{"$f":"Venezuela!F456","v":5277},{"$f":"Venezuela!G456","v":3943},{"$f":"Venezuela!H456","v":0},null,5608.1500000000005,3992.25,3447.55,2580.4500000000003,17.5]
[69,"69",null,5862.3,4173.6000000000004,3602.9,2696.8,17.5,null,null,{"$f":"Venezuela!D457","v":8992},{"$f":"Venezuela!E457","v":6394},{"$f":"Venezuela!F457","v":5516},{"$f":"Venezuela!G457","v":4122},{"$f":"Venezuela!H457","v":0},null,5862.3,4173.6000000000004,3602.9,2696.8,17.5]
[70,"70",null,5924.7,4217.1500000000005,3638.65,2709.8,17.5,null,null,{"$f":"Venezuela!D458","v":9088},{"$f":"Venezuela!E458","v":6461},{"$f":"Venezuela!F458","v":5571},{"$f":"Venezuela!G458","v":4142},{"$f":"Venezuela!H458","v":0},null,5924.7,4217.1500000000005,3638.65,2709.8,17.5]
[71,"71",null,6668.3,4746.25,4094.3,3048.4500000000003,17.5,null,null,{"$f":"Venezuela!D459","v":10232},{"$f":"Venezuela!E459","v":7275},{"$f":"Venezuela!F459","v":6272},{"$f":"Venezuela!G459","v":4663},{"$f":"Venezuela!H459","v":0},null,6668.3,4746.25,4094.3,3048.4500000000003,17.5]
[72,"72",null,7407.35,5270.1500000000005,4549.3,3387.75,17.5,null,null,{"$f":"Venezuela!D460","v":11369},{"$f":"Venezuela!E460","v":8081},{"$f":"Venezuela!F460","v":6972},{"$f":"Venezuela!G460","v":5185},{"$f":"Venezuela!H460","v":0},null,7407.35,5270.1500000000005,4549.3,3387.75,17.5]
[73,"73",null,8149,5797.95,5003,3725.75,17.5,null,null,{"$f":"Venezuela!D461","v":12510},{"$f":"Venezuela!E461","v":8893},{"$f":"Venezuela!F461","v":7670},{"$f":"Venezuela!G461","v":5705},{"$f":"Venezuela!H461","v":0},null,8149,5797.95,5003,3725.75,17.5]
[74,"74",null,8889.35,6324.45,5458,4065.7000000000003,17.5,null,null,{"$f":"Venezuela!D462","v":13649},{"$f":"Venezuela!E462","v":9703},{"$f":"Venezuela!F462","v":8370},{"$f":"Venezuela!G462","v":6228},{"$f":"Venezuela!H462","v":0},null,8889.35,6324.45,5458,4065.7000000000003,17.5]
[75,"75+",null,9720.7000000000007,6914.6500000000005,5965.6500000000005,4438.1500000000005,17.5,null,null,{"$f":"Venezuela!D463","v":14928},{"$f":"Venezuela!E463","v":10611},{"$f":"Venezuela!F463","v":9151},{"$f":"Venezuela!G463","v":6801},{"$f":"Venezuela!H463","v":0},null,9720.7000000000007,6914.6500000000005,5965.6500000000005,4438.1500000000005,17.5]
[1,"1 Child",null,482.25,349,301.55,227.45000000000002,17.5,null,null,{"$f":"Venezuela!D464","v":715},{"$f":"Venezuela!E464","v":510},{"$f":"Venezuela!F464","v":437},{"$f":"Venezuela!G464","v":323},{"$f":"Venezuela!H464","v":0},null,{"$f":"(K464-50)*$O$2+50","v":482.25},349,301.55,227.45000000000002,17.5]
[2,"2 Children",null,749.4,538.79999999999995,467.95,350.95,17.5,null,null,{"$f":"Venezuela!D465","v":1126},{"$f":"Venezuela!E465","v":802},{"$f":"Venezuela!F465","v":693},{"$f":"Venezuela!G465","v":513},{"$f":"Venezuela!H465","v":0},null,{"$f":"(K465-50)*$O$2+50","v":749.4},{"$f":"(L465-50)*$O$2+50","v":538.79999999999995},{"$f":"(M465-50)*$O$2+50","v":467.95},{"$f":"(N465-50)*$O$2+50","v":350.95},{"$f":"(O465-50)*$O$2+50","v":17.5}]
[3,"3+ Children",null,1081.55,774.75,670.75,499.15000000000003,17.5,null,null,{"$f":"Venezuela!D466","v":1637},{"$f":"Venezuela!E466","v":1165},{"$f":"Venezuela!F466","v":1005},{"$f":"Venezuela!G466","v":741},{"$f":"Venezuela!H466","v":0},null,1081.55,774.75,670.75,499.15000000000003,17.5]
[1,"Rider Comp. Maternidad",null,225,225,225,225]
[1,"Transplante de organos",null,300,300,300,300]
[]
[]
[]
[]
["TARIFAS SEMESTRALES "]
["EDAD"]
[" "," ",null,"SE2","SE3","SE4","SE5","SE6"]
[18,"18-24",null,{"$f":"+D440*$G$2","v":621.10700000000008},444.37850000000003,385.81350000000003,296.9325,9.2750000000000004]
[25,"25-29",null,690.35149999999999,493.98650000000004,428.18700000000001,327.24850000000004,9.2750000000000004]
[30,"30-34",null,800.5915,571.84350000000006,496.74250000000001,377.89000000000004,9.2750000000000004]
[35,"35-39",null,888.43899999999996,634.19800000000009,549.79549999999995,418.54100000000005,9.2750000000000004]
[40,"40-44",null,1003.1575,715.84450000000004,622.14050000000009,468.83800000000002,9.2750000000000004]
[45,"45-49",null,1165.4170000000001,831.59649999999999,719.28950000000009,544.97250000000008,9.2750000000000004]
[50,"50-54",null,1278.413,911.52050000000008,789.5675,593.54700000000003,9.2750000000000004]
[55,"55-59",null,1513.0175000000002,1078.2585000000001,932.19050000000016,701.3755000000001,9.2750000000000004]
[60,"60",null,1602.932,1141.9910000000002,987.65500000000009,740.30399999999997,9.2750000000000004]
[61,"61",null,1802.7420000000002,1283.925,1109.9525000000001,832.97450000000003,9.2750000000000004]
[62,"62",null,{"$f":"+D450*$G$2","v":2002.2075000000002},1425.8590000000002,1232.9390000000001,925.6450000000001,9.2750000000000004]
[63,"63",null,2203.7400000000002,1569.5155,1355.5810000000001,1018.3155000000002,9.2750000000000004]
[64,"64",null,2402.5165000000002,1710.4160000000002,1479.9455,1109.9525000000001,9.2750000000000004]
[65,"65",null,2418.7080000000005,1721.7845000000002,1487.5245000000002,1114.7755,9.2750000000000004]
[66,"66",null,2431.7990000000004,1731.0860000000002,1495.1035000000002,1118.5650000000001,9.2750000000000004]
[67,"67",null,2703.6095000000005,1925.0395000000001,1661.1525000000001,1243.2740000000001,9.2750000000000004]
[68,"68",null,2972.3195000000005,2115.8924999999999,1827.2015000000001,1367.6385000000002,9.2750000000000004]
[69,"69",null,3107.0190000000002,2212.0080000000003,1909.537,1429.3040000000001,9.2750000000000004]
[70,"70",null,3140.0909999999999,2235.0895000000005,1928.4845000000003,1436.1940000000002,9.2750000000000004]
[71,"71",null,3534.1990000000001,2515.5125000000003,2169.9790000000003,1615.6785000000002,9.2750000000000004]
[72,"72",null,{"$f":"+D460*$G$2","v":3925.8955000000005},2793.1795000000006,2411.1290000000004,1795.5075000000002,9.2750000000000004]
[73,"73",null,4318.97,3072.9135000000001,2651.59,1974.6475,9.2750000000000004]
[74,"74",null,4711.3555000000006,3351.9585000000002,2892.7400000000002,2154.8210000000004,9.2750000000000004]
[75,"75+",null,5151.9710000000005,3664.7645000000007,3161.7945000000004,2352.2195000000006,9.2750000000000004]
[1,"1 Child",null,255.5925,184.97,159.82150000000001,120.54850000000002,9.2750000000000004]
[2,"2 Children",null,397.18200000000002,285.56399999999996,248.01349999999999,186.0035,9.2750000000000004]
[3,"3+ Children",null,573.22149999999999,410.61750000000001,355.4975,264.54950000000002,9.2750000000000004]
[1,"Rider Comp. Maternidad",null,119.25,119.25,119.25,119.25,0]
[1,"Transplante de organos",null,159,159,159,159,0]
[]
[]
[]
[]
["ESSENTIAL"]
["TARIFAS ANUALES"]
["EDAD"]
[" "," ",null,"ET2","ET3","ET4","ET5","ET6"]
[18,"18-24",null,{"$f":"Q513","v":17.5},{"$f":"R513","v":17.5},17.5,17.5,17.5,null,null,{"$f":"IF($C$2=2,Venezuela!D513,IF($C$2=3,#REF!,IF($C$2=4,#REF!,IF($C$2=5,#REF!,IF($C$2=6,#REF!,IF($C$2=8,#REF!,IF($C$2=9,#REF!,IF($C$2=\"PERU2020\",#REF!))))))))","v":false},{"$f":"IF($C$2=2,Venezuela!E513,IF($C$2=3,#REF!,IF($C$2=4,#REF!,IF($C$2=5,#REF!,IF($C$2=6,#REF!,IF($C$2=8,#REF!,IF($C$2=9,#REF!,IF($C$2=\"PERU2020\",#REF!))))))))","v":false},{"$f":"IF($C$2=2,Venezuela!F513,IF($C$2=3,#REF!,IF($C$2=4,#REF!,IF($C$2=5,#REF!,IF($C$2=6,#REF!,IF($C$2=8,#REF!,IF($C$2=9,#REF!,IF($C$2=\"PERU2020\",#REF!))))))))","v":false},{"$f":"IF($C$2=2,Venezuela!G513,IF($C$2=3,#REF!,IF($C$2=4,#REF!,IF($C$2=5,#REF!,IF($C$2=6,#REF!,IF($C$2=8,#REF!,IF($C$2=9,#REF!,IF($C$2=\"PERU2020\",#REF!))))))))","v":false},{"$f":"IF($C$2=2,Venezuela!H513,IF($C$2=3,#REF!,IF($C$2=4,#REF!,IF($C$2=5,#REF!,IF($C$2=6,#REF!,IF($C$2=8,#REF!,IF($C$2=9,#REF!,IF($C$2=\"PERU2020\",#REF!))))))))","v":false},null,{"$f":"(K513-50)*$P$2+50","v":17.5},{"$f":"(L513-50)*$P$2+50","v":17.5},17.5,17.5,17.5]
[25,"25-29",null,{"$f":"Q514","v":17.5},{"$f":"R514","v":17.5},{"$f":"S514","v":17.5},{"$f":"T514","v":17.5},{"$f":"U514","v":17.5},null,null,{"$f":"IF($C$2=2,Venezuela!D514,IF($C$2=3,#REF!,IF($C$2=4,#REF!,IF($C$2=5,#REF!,IF($C$2=6,#REF!,IF($C$2=8,#REF!,IF($C$2=9,#REF!,IF($C$2=\"PERU2020\",#REF!))))))))","v":false},{"$f":"IF($C$2=2,Venezuela!E514,IF($C$2=3,#REF!,IF($C$2=4,#REF!,IF($C$2=5,#REF!,IF($C$2=6,#REF!,IF($C$2=8,#REF!,IF($C$2=9,#REF!,IF($C$2=\"PERU2020\",#REF!))))))))","v":false},{"$f":"IF($C$2=2,Venezuela!F514,IF($C$2=3,#REF!,IF($C$2=4,#REF!,IF($C$2=5,#REF!,IF($C$2=6,#REF!,IF($C$2=8,#REF!,IF($C$2=9,#REF!,IF($C$2=\"PERU2020\",#REF!))))))))","v":false},{"$f":"IF($C$2=2,Venezuela!G514,IF($C$2=3,#REF!,IF($C$2=4,#REF!,IF($C$2=5,#REF!,IF($C$2=6,#REF!,IF($C$2=8,#REF!,IF($C$2=9,#REF!,IF($C$2=\"PERU2020\",#REF!))))))))","v":false},{"$f":"IF($C$2=2,Venezuela!H514,IF($C$2=3,#REF!,IF($C$2=4,#REF!,IF($C$2=5,#REF!,IF($C$2=6,#REF!,IF($C$2=8,#REF!,IF($C$2=9,#REF!,IF($C$2=\"PERU2020\",#REF!))))))))","v":false},null,{"$f":"(K514-50)*$P$2+50","v":17.5},{"$f":"(L514-50)*$P$2+50","v":17.5},{"$f":"(M514-50)*$P$2+50","v":17.5},{"$f":"(N514-50)*$P$2+50","v":17.5},{"$f":"(O514-50)*$P$2+50","v":17.5}]
[30,"30-34",null,17.5,17.5,17.5,17.5,17.5,null,null,{"$f":"IF($C$2=2,Venezuela!D515,IF($C$2=3,#REF!,IF($C$2=4,#REF!,IF($C$2=5,#REF!,IF($C$2=6,#REF!,IF($C$2=8,#REF!,IF($C$2=9,#REF!,IF($C$2=\"PERU2020\",#REF!))))))))","v":false},{"$f":"IF($C$2=2,Venezuela!E515,IF($C$2=3,#REF!,IF($C$2=4,#REF!,IF($C$2=5,#REF!,IF($C$2=6,#REF!,IF($C$2=8,#REF!,IF($C$2=9,#REF!,IF($C$2=\"PERU2020\",#REF!))))))))","v":false},{"$f":"IF($C$2=2,Venezuela!F515,IF($C$2=3,#REF!,IF($C$2=4,#REF!,IF($C$2=5,#REF!,IF($C$2=6,#REF!,IF($C$2=8,#REF!,IF($C$2=9,#REF!,IF($C$2=\"PERU2020\",#REF!))))))))","v":false},{"$f":"IF($C$2=2,Venezuela!G515,IF($C$2=3,#REF!,IF($C$2=4,#REF!,IF($C$2=5,#REF!,IF($C$2=6,#REF!,IF($C$2=8,#REF!,IF($C$2=9,#REF!,IF($C$2=\"PERU2020\",#REF!))))))))","v":false},{"$f":"IF($C$2=2,Venezuela!H515,IF($C$2=3,#REF!,IF($C$2=4,#REF!,IF($C$2=5,#REF!,IF($C$2=6,#REF!,IF($C$2=8,#REF!,IF($C$2=9,#REF!,IF($C$2=\"PERU2020\",#REF!))))))))","v":false},null,17.5,17.5,17.5,17.5,17.5]
[35,"35-39",null,17.5,17.5,17.5,17.5,17.5,null,null,{"$f":"IF($C$2=2,Venezuela!D516,IF($C$2=3,#REF!,IF($C$2=4,#REF!,IF($C$2=5,#REF!,IF($C$2=6,#REF!,IF($C$2=8,#REF!,IF($C$2=9,#REF!,IF($C$2=\"PERU2020\",#REF!))))))))","v":false},{"$f":"IF($C$2=2,Venezuela!E516,IF($C$2=3,#REF!,IF($C$2=4,#REF!,IF($C$2=5,#REF!,IF($C$2=6,#REF!,IF($C$2=8,#REF!,IF($C$2=9,#REF!,IF($C$2=\"PERU2020\",#REF!))))))))","v":false},{"$f":"IF($C$2=2,Venezuela!F516,IF($C$2=3,#REF!,IF($C$2=4,#REF!,IF($C$2=5,#REF!,IF($C$2=6,#REF!,IF($C$2=8,#REF!,IF($C$2=9,#REF!,IF($C$2=\"PERU2020\",#REF!))))))))","v":false},{"$f":"IF($C$2=2,Venezuela!G516,IF($C$2=3,#REF!,IF($C$2=4,#REF!,IF($C$2=5,#REF!,IF($C$2=6,#REF!,IF($C$2=8,#REF!,IF($C$2=9,#REF!,IF($C$2=\"PERU2020\",#REF!))))))))","v":false},{"$f":"IF($C$2=2,Venezuela!H516,IF($C$2=3,#REF!,IF($C$2=4,#REF!,IF($C$2=5,#REF!,IF($C$2=6,#REF!,IF($C$2=8,#REF!,IF($C$2=9,#REF!,IF($C$2=\"PERU2020\",#REF!))))))))","v":false},null,17.5,17.5,17.5,17.5,17.5]
[40,"40-44",null,17.5,17.5,17.5,17.5,17.5,null,null,{"$f":"IF($C$2=2,Venezuela!D517,IF($C$2=3,#REF!,IF($C$2=4,#REF!,IF($C$2=5,#REF!,IF($C$2=6,#REF!,IF($C$2=8,#REF!,IF($C$2=9,#REF!,IF($C$2=\"PERU2020\",#REF!))))))))","v":false},{"$f":"IF($C$2=2,Venezuela!E517,IF($C$2=3,#REF!,IF($C$2=4,#REF!,IF($C$2=5,#REF!,IF($C$2=6,#REF!,IF($C$2=8,#REF!,IF($C$2=9,#REF!,IF($C$2=\"PERU2020\",#REF!))))))))","v":false},{"$f":"IF($C$2=2,Venezuela!F517,IF($C$2=3,#REF!,IF($C$2=4,#REF!,IF($C$2=5,#REF!,IF($C$2=6,#REF!,IF($C$2=8,#REF!,IF($C$2=9,#REF!,IF($C$2=\"PERU2020\",#REF!))))))))","v":false},{"$f":"IF($C$2=2,Venezuela!G517,IF($C$2=3,#REF!,IF($C$2=4,#REF!,IF($C$2=5,#REF!,IF($C$2=6,#REF!,IF($C$2=8,#REF!,IF($C$2=9,#REF!,IF($C$2=\"PERU2020\",#REF!))))))))","v":false},{"$f":"IF($C$2=2,Venezuela!H517,IF($C$2=3,#REF!,IF($C$2=4,#REF!,IF($C$2=5,#REF!,IF($C$2=6,#REF!,IF($C$2=8,#REF!,IF($C$2=9,#REF!,IF($C$2=\"PERU2020\",#REF!))))))))","v":false},null,17.5,17.5,17.5,17.5,17.5]
[45,"45-49",null,17.5,17.5,17.5,17.5,17.5,null,null,{"$f":"IF($C$2=2,Venezuela!D518,IF($C$2=3,#REF!,IF($C$2=4,#REF!,IF($C$2=5,#REF!,IF($C$2=6,#REF!,IF($C$2=8,#REF!,IF($C$2=9,#REF!,IF($C$2=\"PERU2020\",#REF!))))))))","v":false},{"$f":"IF($C$2=2,Venezuela!E518,IF($C$2=3,#REF!,IF($C$2=4,#REF!,IF($C$2=5,#REF!,IF($C$2=6,#REF!,IF($C$2=8,#REF!,IF($C$2=9,#REF!,IF($C$2=\"PERU2020\",#REF!))))))))","v":false},{"$f":"IF($C$2=2,Venezuela!F518,IF($C$2=3,#REF!,IF($C$2=4,#REF!,IF($C$2=5,#REF!,IF($C$2=6,#REF!,IF($C$2=8,#REF!,IF($C$2=9,#REF!,IF($C$2=\"PERU2020\",#REF!))))))))","v":false},{"$f":"IF($C$2=2,Venezuela!G518,IF($C$2=3,#REF!,IF($C$2=4,#REF!,IF($C$2=5,#REF!,IF($C$2=6,#REF!,IF($C$2=8,#REF!,IF($C$2=9,#REF!,IF($C$2=\"PERU2020\",#REF!))))))))","v":false},{"$f":"IF($C$2=2,Venezuela!H518,IF($C$2=3,#REF!,IF($C$2=4,#REF!,IF($C$2=5,#REF!,IF($C$2=6,#REF!,IF($C$2=8,#REF!,IF($C$2=9,#REF!,IF($C$2=\"PERU2020\",#REF!))))))))","v":false},null,17.5,17.5,17.5,17.5,17.5]
[50,"50-54",null,17.5,17.5,17.5,17.5,17.5,null,null,{"$f":"IF($C$2=2,Venezuela!D519,IF($C$2=3,#REF!,IF($C$2=4,#REF!,IF($C$2=5,#REF!,IF($C$2=6,#REF!,IF($C$2=8,#REF!,IF($C$2=9,#REF!,IF($C$2=\"PERU2020\",#REF!))))))))","v":false},{"$f":"IF($C$2=2,Venezuela!E519,IF($C$2=3,#REF!,IF($C$2=4,#REF!,IF($C$2=5,#REF!,IF($C$2=6,#REF!,IF($C$2=8,#REF!,IF($C$2=9,#REF!,IF($C$2=\"PERU2020\",#REF!))))))))","v":false},{"$f":"IF($C$2=2,Venezuela!F519,IF($C$2=3,#REF!,IF($C$2=4,#REF!,IF($C$2=5,#REF!,IF($C$2=6,#REF!,IF($C$2=8,#REF!,IF($C$2=9,#REF!,IF($C$2=\"PERU2020\",#REF!))))))))","v":false},{"$f":"IF($C$2=2,Venezuela!G519,IF($C$2=3,#REF!,IF($C$2=4,#REF!,IF($C$2=5,#REF!,IF($C$2=6,#REF!,IF($C$2=8,#REF!,IF($C$2=9,#REF!,IF($C$2=\"PERU2020\",#REF!))))))))","v":false},{"$f":"IF($C$2=2,Venezuela!H519,IF($C$2=3,#REF!,IF($C$2=4,#REF!,IF($C$2=5,#REF!,IF($C$2=6,#REF!,IF($C$2=8,#REF!,IF($C$2=9,#REF!,IF($C$2=\"PERU2020\",#REF!))))))))","v":false},null,17.5,17.5,17.5,17.5,17.5]
[55,"55-59",null,17.5,17.5,17.5,17.5,17.5,null,null,{"$f":"IF($C$2=2,Venezuela!D520,IF($C$2=3,#REF!,IF($C$2=4,#REF!,IF($C$2=5,#REF!,IF($C$2=6,#REF!,IF($C$2=8,#REF!,IF($C$2=9,#REF!,IF($C$2=\"PERU2020\",#REF!))))))))","v":false},{"$f":"IF($C$2=2,Venezuela!E520,IF($C$2=3,#REF!,IF($C$2=4,#REF!,IF($C$2=5,#REF!,IF($C$2=6,#REF!,IF($C$2=8,#REF!,IF($C$2=9,#REF!,IF($C$2=\"PERU2020\",#REF!))))))))","v":false},{"$f":"IF($C$2=2,Venezuela!F520,IF($C$2=3,#REF!,IF($C$2=4,#REF!,IF($C$2=5,#REF!,IF($C$2=6,#REF!,IF($C$2=8,#REF!,IF($C$2=9,#REF!,IF($C$2=\"PERU2020\",#REF!))))))))","v":false},{"$f":"IF($C$2=2,Venezuela!G520,IF($C$2=3,#REF!,IF($C$2=4,#REF!,IF($C$2=5,#REF!,IF($C$2=6,#REF!,IF($C$2=8,#REF!,IF($C$2=9,#REF!,IF($C$2=\"PERU2020\",#REF!))))))))","v":false},{"$f":"IF($C$2=2,Venezuela!H520,IF($C$2=3,#REF!,IF($C$2=4,#REF!,IF($C$2=5,#REF!,IF($C$2=6,#REF!,IF($C$2=8,#REF!,IF($C$2=9,#REF!,IF($C$2=\"PERU2020\",#REF!))))))))","v":false},null,17.5,17.5,17.5,17.5,17.5]
[60,"60",null,17.5,17.5,17.5,17.5,17.5,null,null,{"$f":"IF($C$2=2,Venezuela!D521,IF($C$2=3,#REF!,IF($C$2=4,#REF!,IF($C$2=5,#REF!,IF($C$2=6,#REF!,IF($C$2=8,#REF!,IF($C$2=9,#REF!,IF($C$2=\"PERU2020\",#REF!))))))))","v":false},{"$f":"IF($C$2=2,Venezuela!E521,IF($C$2=3,#REF!,IF($C$2=4,#REF!,IF($C$2=5,#REF!,IF($C$2=6,#REF!,IF($C$2=8,#REF!,IF($C$2=9,#REF!,IF($C$2=\"PERU2020\",#REF!))))))))","v":false},{"$f":"IF($C$2=2,Venezuela!F521,IF($C$2=3,#REF!,IF($C$2=4,#REF!,IF($C$2=5,#REF!,IF($C$2=6,#REF!,IF($C$2=8,#REF!,IF($C$2=9,#REF!,IF($C$2=\"PERU2020\",#REF!))))))))","v":false},{"$f":"IF($C$2=2,Venezuela!G521,IF($C$2=3,#REF!,IF($C$2=4,#REF!,IF($C$2=5,#REF!,IF($C$2=6,#REF!,IF($C$2=8,#REF!,IF($C$2=9,#REF!,IF($C$2=\"PERU2020\",#REF!))))))))","v":false},{"$f":"IF($C$2=2,Venezuela!H521,IF($C$2=3,#REF!,IF($C$2=4,#REF!,IF($C$2=5,#REF!,IF($C$2=6,#REF!,IF($C$2=8,#REF!,IF($C$2=9,#REF!,IF($C$2=\"PERU2020\",#REF!))))))))","v":false},null,17.5,17.5,17.5,17.5,17.5]
[61,"61",null,17.5,17.5,17.5,17.5,17.5,null,null,{"$f":"IF($C$2=2,Venezuela!D522,IF($C$2=3,#REF!,IF($C$2=4,#REF!,IF($C$2=5,#REF!,IF($C$2=6,#REF!,IF($C$2=8,#REF!,IF($C$2=9,#REF!,IF($C$2=\"PERU2020\",#REF!))))))))","v":false},{"$f":"IF($C$2=2,Venezuela!E522,IF($C$2=3,#REF!,IF($C$2=4,#REF!,IF($C$2=5,#REF!,IF($C$2=6,#REF!,IF($C$2=8,#REF!,IF($C$2=9,#REF!,IF($C$2=\"PERU2020\",#REF!))))))))","v":false},{"$f":"IF($C$2=2,Venezuela!F522,IF($C$2=3,#REF!,IF($C$2=4,#REF!,IF($C$2=5,#REF!,IF($C$2=6,#REF!,IF($C$2=8,#REF!,IF($C$2=9,#REF!,IF($C$2=\"PERU2020\",#REF!))))))))","v":false},{"$f":"IF($C$2=2,Venezuela!G522,IF($C$2=3,#REF!,IF($C$2=4,#REF!,IF($C$2=5,#REF!,IF($C$2=6,#REF!,IF($C$2=8,#REF!,IF($C$2=9,#REF!,IF($C$2=\"PERU2020\",#REF!))))))))","v":false},{"$f":"IF($C$2=2,Venezuela!H522,IF($C$2=3,#REF!,IF($C$2=4,#REF!,IF($C$2=5,#REF!,IF($C$2=6,#REF!,IF($C$2=8,#REF!,IF($C$2=9,#REF!,IF($C$2=\"PERU2020\",#REF!))))))))","v":false},null,17.5,17.5,17.5,17.5,17.5]
[62,"62",null,17.5,17.5,17.5,17.5,17.5,null,null,{"$f":"IF($C$2=2,Venezuela!D523,IF($C$2=3,#REF!,IF($C$2=4,#REF!,IF($C$2=5,#REF!,IF($C$2=6,#REF!,IF($C$2=8,#REF!,IF($C$2=9,#REF!,IF($C$2=\"PERU2020\",#REF!))))))))","v":false},{"$f":"IF($C$2=2,Venezuela!E523,IF($C$2=3,#REF!,IF($C$2=4,#REF!,IF($C$2=5,#REF!,IF($C$2=6,#REF!,IF($C$2=8,#REF!,IF($C$2=9,#REF!,IF($C$2=\"PERU2020\",#REF!))))))))","v":false},{"$f":"IF($C$2=2,Venezuela!F523,IF($C$2=3,#REF!,IF($C$2=4,#REF!,IF($C$2=5,#REF!,IF($C$2=6,#REF!,IF($C$2=8,#REF!,IF($C$2=9,#REF!,IF($C$2=\"PERU2020\",#REF!))))))))","v":false},{"$f":"IF($C$2=2,Venezuela!G523,IF($C$2=3,#REF!,IF($C$2=4,#REF!,IF($C$2=5,#REF!,IF($C$2=6,#REF!,IF($C$2=8,#REF!,IF($C$2=9,#REF!,IF($C$2=\"PERU2020\",#REF!))))))))","v":false},{"$f":"IF($C$2=2,Venezuela!H523,IF($C$2=3,#REF!,IF($C$2=4,#REF!,IF($C$2=5,#REF!,IF($C$2=6,#REF!,IF($C$2=8,#REF!,IF($C$2=9,#REF!,IF($C$2=\"PERU2020\",#REF!))))))))","v":false},null,17.5,17.5,17.5,17.5,17.5]
[63,"63",null,17.5,17.5,17.5,17.5,17.5,null,null,{"$f":"IF($C$2=2,Venezuela!D524,IF($C$2=3,#REF!,IF($C$2=4,#REF!,IF($C$2=5,#REF!,IF($C$2=6,#REF!,IF($C$2=8,#REF!,IF($C$2=9,#REF!,IF($C$2=\"PERU2020\",#REF!))))))))","v":false},{"$f":"IF($C$2=2,Venezuela!E524,IF($C$2=3,#REF!,IF($C$2=4,#REF!,IF($C$2=5,#REF!,IF($C$2=6,#REF!,IF($C$2=8,#REF!,IF($C$2=9,#REF!,IF($C$2=\"PERU2020\",#REF!))))))))","v":false},{"$f":"IF($C$2=2,Venezuela!F524,IF($C$2=3,#REF!,IF($C$2=4,#REF!,IF($C$2=5,#REF!,IF($C$2=6,#REF!,IF($C$2=8,#REF!,IF($C$2=9,#REF!,IF($C$2=\"PERU2020\",#REF!))))))))","v":false},{"$f":"IF($C$2=2,Venezuela!G524,IF($C$2=3,#REF!,IF($C$2=4,#REF!,IF($C$2=5,#REF!,IF($C$2=6,#REF!,IF($C$2=8,#REF!,IF($C$2=9,#REF!,IF($C$2=\"PERU2020\",#REF!))))))))","v":false},{"$f":"IF($C$2=2,Venezuela!H524,IF($C$2=3,#REF!,IF($C$2=4,#REF!,IF($C$2=5,#REF!,IF($C$2=6,#REF!,IF($C$2=8,#REF!,IF($C$2=9,#REF!,IF($C$2=\"PERU2020\",#REF!))))))))","v":false},null,17.5,17.5,17.5,17.5,17.5]
[64,"64",null,17.5,17.5,17.5,17.5,17.5,null,null,{"$f":"IF($C$2=2,Venezuela!D525,IF($C$2=3,#REF!,IF($C$2=4,#REF!,IF($C$2=5,#REF!,IF($C$2=6,#REF!,IF($C$2=8,#REF!,IF($C$2=9,#REF!,IF($C$2=\"PERU2020\",#REF!))))))))","v":false},{"$f":"IF($C$2=2,Venezuela!E525,IF($C$2=3,#REF!,IF($C$2=4,#REF!,IF($C$2=5,#REF!,IF($C$2=6,#REF!,IF($C$2=8,#REF!,IF($C$2=9,#REF!,IF($C$2=\"PERU2020\",#REF!))))))))","v":false},{"$f":"IF($C$2=2,Venezuela!F525,IF($C$2=3,#REF!,IF($C$2=4,#REF!,IF($C$2=5,#REF!,IF($C$2=6,#REF!,IF($C$2=8,#REF!,IF($C$2=9,#REF!,IF($C$2=\"PERU2020\",#REF!))))))))","v":false},{"$f":"IF($C$2=2,Venezuela!G525,IF($C$2=3,#REF!,IF($C$2=4,#REF!,IF($C$2=5,#REF!,IF($C$2=6,#REF!,IF($C$2=8,#REF!,IF($C$2=9,#REF!,IF($C$2=\"PERU2020\",#REF!))))))))","v":false},{"$f":"IF($C$2=2,Venezuela!H525,IF($C$2=3,#REF!,IF($C$2=4,#REF!,IF($C$2=5,#REF!,IF($C$2=6,#REF!,IF($C$2=8,#REF!,IF($C$2=9,#REF!,IF($C$2=\"PERU2020\",#REF!))))))))","v":false},null,17.5,17.5,17.5,17.5,17.5]
[65,"65",null,17.5,17.5,17.5,17.5,17.5,null,null,{"$f":"IF($C$2=2,Venezuela!D526,IF($C$2=3,#REF!,IF($C$2=4,#REF!,IF($C$2=5,#REF!,IF($C$2=6,#REF!,IF($C$2=8,#REF!,IF($C$2=9,#REF!,IF($C$2=\"PERU2020\",#REF!))))))))","v":false},{"$f":"IF($C$2=2,Venezuela!E526,IF($C$2=3,#REF!,IF($C$2=4,#REF!,IF($C$2=5,#REF!,IF($C$2=6,#REF!,IF($C$2=8,#REF!,IF($C$2=9,#REF!,IF($C$2=\"PERU2020\",#REF!))))))))","v":false},{"$f":"IF($C$2=2,Venezuela!F526,IF($C$2=3,#REF!,IF($C$2=4,#REF!,IF($C$2=5,#REF!,IF($C$2=6,#REF!,IF($C$2=8,#REF!,IF($C$2=9,#REF!,IF($C$2=\"PERU2020\",#REF!))))))))","v":false},{"$f":"IF($C$2=2,Venezuela!G526,IF($C$2=3,#REF!,IF($C$2=4,#REF!,IF($C$2=5,#REF!,IF($C$2=6,#REF!,IF($C$2=8,#REF!,IF($C$2=9,#REF!,IF($C$2=\"PERU2020\",#REF!))))))))","v":false},{"$f":"IF($C$2=2,Venezuela!H526,IF($C$2=3,#REF!,IF($C$2=4,#REF!,IF($C$2=5,#REF!,IF($C$2=6,#REF!,IF($C$2=8,#REF!,IF($C$2=9,#REF!,IF($C$2=\"PERU2020\",#REF!))))))))","v":false},null,17.5,17.5,17.5,17.5,17.5]
[66,"66",null,17.5,17.5,17.5,17.5,17.5,null,null,{"$f":"IF($C$2=2,Venezuela!D527,IF($C$2=3,#REF!,IF($C$2=4,#REF!,IF($C$2=5,#REF!,IF($C$2=6,#REF!,IF($C$2=8,#REF!,IF($C$2=9,#REF!,IF($C$2=\"PERU2020\",#REF!))))))))","v":false},{"$f":"IF($C$2=2,Venezuela!E527,IF($C$2=3,#REF!,IF($C$2=4,#REF!,IF($C$2=5,#REF!,IF($C$2=6,#REF!,IF($C$2=8,#REF!,IF($C$2=9,#REF!,IF($C$2=\"PERU2020\",#REF!))))))))","v":false},{"$f":"IF($C$2=2,Venezuela!F527,IF($C$2=3,#REF!,IF($C$2=4,#REF!,IF($C$2=5,#REF!,IF($C$2=6,#REF!,IF($C$2=8,#REF!,IF($C$2=9,#REF!,IF($C$2=\"PERU2020\",#REF!))))))))","v":false},{"$f":"IF($C$2=2,Venezuela!G527,IF($C$2=3,#REF!,IF($C$2=4,#REF!,IF($C$2=5,#REF!,IF($C$2=6,#REF!,IF($C$2=8,#REF!,IF($C$2=9,#REF!,IF($C$2=\"PERU2020\",#REF!))))))))","v":false},{"$f":"IF($C$2=2,Venezuela!H527,IF($C$2=3,#REF!,IF($C$2=4,#REF!,IF($C$2=5,#REF!,IF($C$2=6,#REF!,IF($C$2=8,#REF!,IF($C$2=9,#REF!,IF($C$2=\"PERU2020\",#REF!))))))))","v":false},null,17.5,17.5,17.5,17.5,17.5]
[67,"67",null,17.5,17.5,17.5,17.5,17.5,null,null,{"$f":"IF($C$2=2,Venezuela!D528,IF($C$2=3,#REF!,IF($C$2=4,#REF!,IF($C$2=5,#REF!,IF($C$2=6,#REF!,IF($C$2=8,#REF!,IF($C$2=9,#REF!,IF($C$2=\"PERU2020\",#REF!))))))))","v":false},{"$f":"IF($C$2=2,Venezuela!E528,IF($C$2=3,#REF!,IF($C$2=4,#REF!,IF($C$2=5,#REF!,IF($C$2=6,#REF!,IF($C$2=8,#REF!,IF($C$2=9,#REF!,IF($C$2=\"PERU2020\",#REF!))))))))","v":false},{"$f":"IF($C$2=2,Venezuela!F528,IF($C$2=3,#REF!,IF($C$2=4,#REF!,IF($C$2=5,#REF!,IF($C$2=6,#REF!,IF($C$2=8,#REF!,IF($C$2=9,#REF!,IF($C$2=\"PERU2020\",#REF!))))))))","v":false},{"$f":"IF($C$2=2,Venezuela!G528,IF($C$2=3,#REF!,IF($C$2=4,#REF!,IF($C$2=5,#REF!,IF($C$2=6,#REF!,IF($C$2=8,#REF!,IF($C$2=9,#REF!,IF($C$2=\"PERU2020\",#REF!))))))))","v":false},{"$f":"IF($C$2=2,Venezuela!H528,IF($C$2=3,#REF!,IF($C$2=4,#REF!,IF($C$2=5,#REF!,IF($C$2=6,#REF!,IF($C$2=8,#REF!,IF($C$2=9,#REF!,IF($C$2=\"PERU2020\",#REF!))))))))","v":false},null,17.5,17.5,17.5,17.5,17.5]
[68,"68",null,17.5,17.5,17.5,17.5,17.5,null,null,{"$f":"IF($C$2=2,Venezuela!D529,IF($C$2=3,#REF!,IF($C$2=4,#REF!,IF($C$2=5,#REF!,IF($C$2=6,#REF!,IF($C$2=8,#REF!,IF($C$2=9,#REF!,IF($C$2=\"PERU2020\",#REF!))))))))","v":false},{"$f":"IF($C$2=2,Venezuela!E529,IF($C$2=3,#REF!,IF($C$2=4,#REF!,IF($C$2=5,#REF!,IF($C$2=6,#REF!,IF($C$2=8,#REF!,IF($C$2=9,#REF!,IF($C$2=\"PERU2020\",#REF!))))))))","v":false},{"$f":"IF($C$2=2,Venezuela!F529,IF($C$2=3,#REF!,IF($C$2=4,#REF!,IF($C$2=5,#REF!,IF($C$2=6,#REF!,IF($C$2=8,#REF!,IF($C$2=9,#REF!,IF($C$2=\"PERU2020\",#REF!))))))))","v":false},{"$f":"IF($C$2=2,Venezuela!G529,IF($C$2=3,#REF!,IF($C$2=4,#REF!,IF($C$2=5,#REF!,IF($C$2=6,#REF!,IF($C$2=8,#REF!,IF($C$2=9,#REF!,IF($C$2=\"PERU2020\",#REF!))))))))","v":false},{"$f":"IF($C$2=2,Venezuela!H529,IF($C$2=3,#REF!,IF($C$2=4,#REF!,IF($C$2=5,#REF!,IF($C$2=6,#REF!,IF($C$2=8,#REF!,IF($C$2=9,#REF!,IF($C$2=\"PERU2020\",#REF!))))))))","v":false},null,17.5,17.5,17.5,17.5,17.5]
[69,"69",null,17.5,17.5,17.5,17.5,17.5,null,null,{"$f":"IF($C$2=2,Venezuela!D530,IF($C$2=3,#REF!,IF($C$2=4,#REF!,IF($C$2=5,#REF!,IF($C$2=6,#REF!,IF($C$2=8,#REF!,IF($C$2=9,#REF!,IF($C$2=\"PERU2020\",#REF!))))))))","v":false},{"$f":"IF($C$2=2,Venezuela!E530,IF($C$2=3,#REF!,IF($C$2=4,#REF!,IF($C$2=5,#REF!,IF($C$2=6,#REF!,IF($C$2=8,#REF!,IF($C$2=9,#REF!,IF($C$2=\"PERU2020\",#REF!))))))))","v":false},{"$f":"IF($C$2=2,Venezuela!F530,IF($C$2=3,#REF!,IF($C$2=4,#REF!,IF($C$2=5,#REF!,IF($C$2=6,#REF!,IF($C$2=8,#REF!,IF($C$2=9,#REF!,IF($C$2=\"PERU2020\",#REF!))))))))","v":false},{"$f":"IF($C$2=2,Venezuela!G530,IF($C$2=3,#REF!,IF($C$2=4,#REF!,IF($C$2=5,#REF!,IF($C$2=6,#REF!,IF($C$2=8,#REF!,IF($C$2=9,#REF!,IF($C$2=\"PERU2020\",#REF!))))))))","v":false},{"$f":"IF($C$2=2,Venezuela!H530,IF($C$2=3,#REF!,IF($C$2=4,#REF!,IF($C$2=5,#REF!,IF($C$2=6,#REF!,IF($C$2=8,#REF!,IF($C$2=9,#REF!,IF($C$2=\"PERU2020\",#REF!))))))))","v":false},null,17.5,17.5,17.5,17.5,17.5]
[70,"70",null,17.5,17.5,17.5,17.5,17.5,null,null,{"$f":"IF($C$2=2,Venezuela!D531,IF($C$2=3,#REF!,IF($C$2=4,#REF!,IF($C$2=5,#REF!,IF($C$2=6,#REF!,IF($C$2=8,#REF!,IF($C$2=9,#REF!,IF($C$2=\"PERU2020\",#REF!))))))))","v":false},{"$f":"IF($C$2=2,Venezuela!E531,IF($C$2=3,#REF!,IF($C$2=4,#REF!,IF($C$2=5,#REF!,IF($C$2=6,#REF!,IF($C$2=8,#REF!,IF($C$2=9,#REF!,IF($C$2=\"PERU2020\",#REF!))))))))","v":false},{"$f":"IF($C$2=2,Venezuela!F531,IF($C$2=3,#REF!,IF($C$2=4,#REF!,IF($C$2=5,#REF!,IF($C$2=6,#REF!,IF($C$2=8,#REF!,IF($C$2=9,#REF!,IF($C$2=\"PERU2020\",#REF!))))))))","v":false},{"$f":"IF($C$2=2,Venezuela!G531,IF($C$2=3,#REF!,IF($C$2=4,#REF!,IF($C$2=5,#REF!,IF($C$2=6,#REF!,IF($C$2=8,#REF!,IF($C$2=9,#REF!,IF($C$2=\"PERU2020\",#REF!))))))))","v":false},{"$f":"IF($C$2=2,Venezuela!H531,IF($C$2=3,#REF!,IF($C$2=4,#REF!,IF($C$2=5,#REF!,IF($C$2=6,#REF!,IF($C$2=8,#REF!,IF($C$2=9,#REF!,IF($C$2=\"PERU2020\",#REF!))))))))","v":false},null,17.5,17.5,17.5,17.5,17.5]
[71,"71",null,17.5,17.5,17.5,17.5,17.5,null,null,{"$f":"IF($C$2=2,Venezuela!D532,IF($C$2=3,#REF!,IF($C$2=4,#REF!,IF($C$2=5,#REF!,IF($C$2=6,#REF!,IF($C$2=8,#REF!,IF($C$2=9,#REF!,IF($C$2=\"PERU2020\",#REF!))))))))","v":false},{"$f":"IF($C$2=2,Venezuela!E532,IF($C$2=3,#REF!,IF($C$2=4,#REF!,IF($C$2=5,#REF!,IF($C$2=6,#REF!,IF($C$2=8,#REF!,IF($C$2=9,#REF!,IF($C$2=\"PERU2020\",#REF!))))))))","v":false},{"$f":"IF($C$2=2,Venezuela!F532,IF($C$2=3,#REF!,IF($C$2=4,#REF!,IF($C$2=5,#REF!,IF($C$2=6,#REF!,IF($C$2=8,#REF!,IF($C$2=9,#REF!,IF($C$2=\"PERU2020\",#REF!))))))))","v":false},{"$f":"IF($C$2=2,Venezuela!G532,IF($C$2=3,#REF!,IF($C$2=4,#REF!,IF($C$2=5,#REF!,IF($C$2=6,#REF!,IF($C$2=8,#REF!,IF($C$2=9,#REF!,IF($C$2=\"PERU2020\",#REF!))))))))","v":false},{"$f":"IF($C$2=2,Venezuela!H532,IF($C$2=3,#REF!,IF($C$2=4,#REF!,IF($C$2=5,#REF!,IF($C$2=6,#REF!,IF($C$2=8,#REF!,IF($C$2=9,#REF!,IF($C$2=\"PERU2020\",#REF!))))))))","v":false},null,17.5,17.5,17.5,17.5,17.5]
[72,"72",null,17.5,17.5,17.5,17.5,17.5,null,null,{"$f":"IF($C$2=2,Venezuela!D533,IF($C$2=3,#REF!,IF($C$2=4,#REF!,IF($C$2=5,#REF!,IF($C$2=6,#REF!,IF($C$2=8,#REF!,IF($C$2=9,#REF!,IF($C$2=\"PERU2020\",#REF!))))))))","v":false},{"$f":"IF($C$2=2,Venezuela!E533,IF($C$2=3,#REF!,IF($C$2=4,#REF!,IF($C$2=5,#REF!,IF($C$2=6,#REF!,IF($C$2=8,#REF!,IF($C$2=9,#REF!,IF($C$2=\"PERU2020\",#REF!))))))))","v":false},{"$f":"IF($C$2=2,Venezuela!F533,IF($C$2=3,#REF!,IF($C$2=4,#REF!,IF($C$2=5,#REF!,IF($C$2=6,#REF!,IF($C$2=8,#REF!,IF($C$2=9,#REF!,IF($C$2=\"PERU2020\",#REF!))))))))","v":false},{"$f":"IF($C$2=2,Venezuela!G533,IF($C$2=3,#REF!,IF($C$2=4,#REF!,IF($C$2=5,#REF!,IF($C$2=6,#REF!,IF($C$2=8,#REF!,IF($C$2=9,#REF!,IF($C$2=\"PERU2020\",#REF!))))))))","v":false},{"$f":"IF($C$2=2,Venezuela!H533,IF($C$2=3,#REF!,IF($C$2=4,#REF!,IF($C$2=5,#REF!,IF($C$2=6,#REF!,IF($C$2=8,#REF!,IF($C$2=9,#REF!,IF($C$2=\"PERU2020\",#REF!))))))))","v":false},null,17.5,17.5,17.5,17.5,17.5]
[73,"73",null,17.5,17.5,17.5,17.5,17.5,null,null,{"$f":"IF($C$2=2,Venezuela!D534,IF($C$2=3,#REF!,IF($C$2=4,#REF!,IF($C$2=5,#REF!,IF($C$2=6,#REF!,IF($C$2=8,#REF!,IF($C$2=9,#REF!,IF($C$2=\"PERU2020\",#REF!))))))))","v":false},{"$f":"IF($C$2=2,Venezuela!E534,IF($C$2=3,#REF!,IF($C$2=4,#REF!,IF($C$2=5,#REF!,IF($C$2=6,#REF!,IF($C$2=8,#REF!,IF($C$2=9,#REF!,IF($C$2=\"PERU2020\",#REF!))))))))","v":false},{"$f":"IF($C$2=2,Venezuela!F534,IF($C$2=3,#REF!,IF($C$2=4,#REF!,IF($C$2=5,#REF!,IF($C$2=6,#REF!,IF($C$2=8,#REF!,IF($C$2=9,#REF!,IF($C$2=\"PERU2020\",#REF!))))))))","v":false},{"$f":"IF($C$2=2,Venezuela!G534,IF($C$2=3,#REF!,IF($C$2=4,#REF!,IF($C$2=5,#REF!,IF($C$2=6,#REF!,IF($C$2=8,#REF!,IF($C$2=9,#REF!,IF($C$2=\"PERU2020\",#REF!))))))))","v":false},{"$f":"IF($C$2=2,Venezuela!H534,IF($C$2=3,#REF!,IF($C$2=4,#REF!,IF($C$2=5,#REF!,IF($C$2=6,#REF!,IF($C$2=8,#REF!,IF($C$2=9,#REF!,IF($C$2=\"PERU2020\",#REF!))))))))","v":false},null,17.5,17.5,17.5,17.5,17.5]
[74,"74",null,17.5,17.5,17.5,17.5,17.5,null,null,{"$f":"IF($C$2=2,Venezuela!D535,IF($C$2=3,#REF!,IF($C$2=4,#REF!,IF($C$2=5,#REF!,IF($C$2=6,#REF!,IF($C$2=8,#REF!,IF($C$2=9,#REF!,IF($C$2=\"PERU2020\",#REF!))))))))","v":false},{"$f":"IF($C$2=2,Venezuela!E535,IF($C$2=3,#REF!,IF($C$2=4,#REF!,IF($C$2=5,#REF!,IF($C$2=6,#REF!,IF($C$2=8,#REF!,IF($C$2=9,#REF!,IF($C$2=\"PERU2020\",#REF!))))))))","v":false},{"$f":"IF($C$2=2,Venezuela!F535,IF($C$2=3,#REF!,IF($C$2=4,#REF!,IF($C$2=5,#REF!,IF($C$2=6,#REF!,IF($C$2=8,#REF!,IF($C$2=9,#REF!,IF($C$2=\"PERU2020\",#REF!))))))))","v":false},{"$f":"IF($C$2=2,Venezuela!G535,IF($C$2=3,#REF!,IF($C$2=4,#REF!,IF($C$2=5,#REF!,IF($C$2=6,#REF!,IF($C$2=8,#REF!,IF($C$2=9,#REF!,IF($C$2=\"PERU2020\",#REF!))))))))","v":false},{"$f":"IF($C$2=2,Venezuela!H535,IF($C$2=3,#REF!,IF($C$2=4,#REF!,IF($C$2=5,#REF!,IF($C$2=6,#REF!,IF($C$2=8,#REF!,IF($C$2=9,#REF!,IF($C$2=\"PERU2020\",#REF!))))))))","v":false},null,17.5,17.5,17.5,17.5,17.5]
[75,"75+",null,17.5,17.5,17.5,17.5,17.5,null,null,{"$f":"IF($C$2=2,Venezuela!D536,IF($C$2=3,#REF!,IF($C$2=4,#REF!,IF($C$2=5,#REF!,IF($C$2=6,#REF!,IF($C$2=8,#REF!,IF($C$2=9,#REF!,IF($C$2=\"PERU2020\",#REF!))))))))","v":false},{"$f":"IF($C$2=2,Venezuela!E536,IF($C$2=3,#REF!,IF($C$2=4,#REF!,IF($C$2=5,#REF!,IF($C$2=6,#REF!,IF($C$2=8,#REF!,IF($C$2=9,#REF!,IF($C$2=\"PERU2020\",#REF!))))))))","v":false},{"$f":"IF($C$2=2,Venezuela!F536,IF($C$2=3,#REF!,IF($C$2=4,#REF!,IF($C$2=5,#REF!,IF($C$2=6,#REF!,IF($C$2=8,#REF!,IF($C$2=9,#REF!,IF($C$2=\"PERU2020\",#REF!))))))))","v":false},{"$f":"IF($C$2=2,Venezuela!G536,IF($C$2=3,#REF!,IF($C$2=4,#REF!,IF($C$2=5,#REF!,IF($C$2=6,#REF!,IF($C$2=8,#REF!,IF($C$2=9,#REF!,IF($C$2=\"PERU2020\",#REF!))))))))","v":false},{"$f":"IF($C$2=2,Venezuela!H536,IF($C$2=3,#REF!,IF($C$2=4,#REF!,IF($C$2=5,#REF!,IF($C$2=6,#REF!,IF($C$2=8,#REF!,IF($C$2=9,#REF!,IF($C$2=\"PERU2020\",#REF!))))))))","v":false},null,17.5,17.5,17.5,17.5,17.5]
[1,"1 Child",null,0,0,0,0,0,null,null,{"$f":"IF($C$2=2,Venezuela!D537,IF($C$2=3,#REF!,IF($C$2=4,#REF!,IF($C$2=5,#REF!,IF($C$2=6,#REF!,IF($C$2=8,#REF!,IF($C$2=9,#REF!,IF($C$2=\"PERU2020\",#REF!))))))))","v":false},{"$f":"IF($C$2=2,Venezuela!E537,IF($C$2=3,#REF!,IF($C$2=4,#REF!,IF($C$2=5,#REF!,IF($C$2=6,#REF!,IF($C$2=8,#REF!,IF($C$2=9,#REF!,IF($C$2=\"PERU2020\",#REF!))))))))","v":false},{"$f":"IF($C$2=2,Venezuela!F537,IF($C$2=3,#REF!,IF($C$2=4,#REF!,IF($C$2=5,#REF!,IF($C$2=6,#REF!,IF($C$2=8,#REF!,IF($C$2=9,#REF!,IF($C$2=\"PERU2020\",#REF!))))))))","v":false},{"$f":"IF($C$2=2,Venezuela!G537,IF($C$2=3,#REF!,IF($C$2=4,#REF!,IF($C$2=5,#REF!,IF($C$2=6,#REF!,IF($C$2=8,#REF!,IF($C$2=9,#REF!,IF($C$2=\"PERU2020\",#REF!))))))))","v":false},{"$f":"IF($C$2=2,Venezuela!H537,IF($C$2=3,#REF!,IF($C$2=4,#REF!,IF($C$2=5,#REF!,IF($C$2=6,#REF!,IF($C$2=8,#REF!,IF($C$2=9,#REF!,IF($C$2=\"PERU2020\",#REF!))))))))","v":false},null,{"$f":"(K537)*$P$2","v":0},{"$f":"(L537)*$P$2","v":0},0,0,0]
[2,"2 Children",null,0,0,0,0,0,null,null,{"$f":"IF($C$2=2,Venezuela!D538,IF($C$2=3,#REF!,IF($C$2=4,#REF!,IF($C$2=5,#REF!,IF($C$2=6,#REF!,IF($C$2=8,#REF!,IF($C$2=9,#REF!,IF($C$2=\"PERU2020\",#REF!))))))))","v":false},{"$f":"IF($C$2=2,Venezuela!E538,IF($C$2=3,#REF!,IF($C$2=4,#REF!,IF($C$2=5,#REF!,IF($C$2=6,#REF!,IF($C$2=8,#REF!,IF($C$2=9,#REF!,IF($C$2=\"PERU2020\",#REF!))))))))","v":false},{"$f":"IF($C$2=2,Venezuela!F538,IF($C$2=3,#REF!,IF($C$2=4,#REF!,IF($C$2=5,#REF!,IF($C$2=6,#REF!,IF($C$2=8,#REF!,IF($C$2=9,#REF!,IF($C$2=\"PERU2020\",#REF!))))))))","v":false},{"$f":"IF($C$2=2,Venezuela!G538,IF($C$2=3,#REF!,IF($C$2=4,#REF!,IF($C$2=5,#REF!,IF($C$2=6,#REF!,IF($C$2=8,#REF!,IF($C$2=9,#REF!,IF($C$2=\"PERU2020\",#REF!))))))))","v":false},{"$f":"IF($C$2=2,Venezuela!H538,IF($C$2=3,#REF!,IF($C$2=4,#REF!,IF($C$2=5,#REF!,IF($C$2=6,#REF!,IF($C$2=8,#REF!,IF($C$2=9,#REF!,IF($C$2=\"PERU2020\",#REF!))))))))","v":false},null,{"$f":"(K538)*$P$2","v":0},{"$f":"(L538)*$P$2","v":0},{"$f":"(M538)*$P$2","v":0},{"$f":"(N538)*$P$2","v":0},{"$f":"(O538)*$P$2","v":0}]
[3,"3+ Children",null,0,0,0,0,0,null,null,{"$f":"IF($C$2=2,Venezuela!D539,IF($C$2=3,#REF!,IF($C$2=4,#REF!,IF($C$2=5,#REF!,IF($C$2=6,#REF!,IF($C$2=8,#REF!,IF($C$2=9,#REF!,IF($C$2=\"PERU2020\",#REF!))))))))","v":false},{"$f":"IF($C$2=2,Venezuela!E539,IF($C$2=3,#REF!,IF($C$2=4,#REF!,IF($C$2=5,#REF!,IF($C$2=6,#REF!,IF($C$2=8,#REF!,IF($C$2=9,#REF!,IF($C$2=\"PERU2020\",#REF!))))))))","v":false},{"$f":"IF($C$2=2,Venezuela!F539,IF($C$2=3,#REF!,IF($C$2=4,#REF!,IF($C$2=5,#REF!,IF($C$2=6,#REF!,IF($C$2=8,#REF!,IF($C$2=9,#REF!,IF($C$2=\"PERU2020\",#REF!))))))))","v":false},{"$f":"IF($C$2=2,Venezuela!G539,IF($C$2=3,#REF!,IF($C$2=4,#REF!,IF($C$2=5,#REF!,IF($C$2=6,#REF!,IF($C$2=8,#REF!,IF($C$2=9,#REF!,IF($C$2=\"PERU2020\",#REF!))))))))","v":false},{"$f":"IF($C$2=2,Venezuela!H539,IF($C$2=3,#REF!,IF($C$2=4,#REF!,IF($C$2=5,#REF!,IF($C$2=6,#REF!,IF($C$2=8,#REF!,IF($C$2=9,#REF!,IF($C$2=\"PERU2020\",#REF!))))))))","v":false},null,0,0,0,0,0]
[1,"Rider Comp. Maternidad",null,225,225,225,225,225]
[1,"Transplante de organos",null,300,300,300,300,300]
[]
[]
[]
["TARIFAS SEMESTRALES "]
["EDAD"]
[" "," ",null,"ET2","ET3","ET4","ET5","ET6"]
[18,"18-24",null,{"$f":"+D513*$G$2","v":9.2750000000000004},9.2750000000000004,9.2750000000000004,9.2750000000000004,9.2750000000000004]
[25,"25-29",null,9.2750000000000004,9.2750000000000004,9.2750000000000004,9.2750000000000004,9.2750000000000004]
[30,"30-34",null,9.2750000000000004,9.2750000000000004,9.2750000000000004,9.2750000000000004,9.2750000000000004]
[35,"35-39",null,9.2750000000000004,9.2750000000000004,9.2750000000000004,9.2750000000000004,9.2750000000000004]
[40,"40-44",null,9.2750000000000004,9.2750000000000004,9.2750000000000004,9.2750000000000004,9.2750000000000004]
[45,"45-49",null,9.2750000000000004,9.2750000000000004,9.2750000000000004,9.2750000000000004,9.2750000000000004]
[50,"50-54",null,9.2750000000000004,9.2750000000000004,9.2750000000000004,9.2750000000000004,9.2750000000000004]
[55,"55-59",null,9.2750000000000004,9.2750000000000004,9.2750000000000004,9.2750000000000004,9.2750000000000004]
[60,"60",null,9.2750000000000004,9.2750000000000004,9.2750000000000004,9.2750000000000004,9.2750000000000004]
[61,"61",null,9.2750000000000004,9.2750000000000004,9.2750000000000004,9.2750000000000004,9.2750000000000004]
[62,"62",null,{"$f":"+D523*$G$2","v":9.2750000000000004},9.2750000000000004,9.2750000000000004,9.2750000000000004,9.2750000000000004]
[63,"63",null,9.2750000000000004,9.2750000000000004,9.2750000000000004,9.2750000000000004,9.2750000000000004]
[64,"64",null,9.2750000000000004,9.2750000000000004,9.2750000000000004,9.2750000000000004,9.2750000000000004]
[65,"65",null,9.2750000000000004,9.2750000000000004,9.2750000000000004,9.2750000000000004,9.2750000000000004]
[66,"66",null,9.2750000000000004,9.2750000000000004,9.2750000000000004,9.2750000000000004,9.2750000000000004]
[67,"67",null,9.2750000000000004,9.2750000000000004,9.2750000000000004,9.2750000000000004,9.2750000000000004]
[68,"68",null,9.2750000000000004,9.2750000000000004,9.2750000000000004,9.2750000000000004,9.2750000000000004]
[69,"69",null,9.2750000000000004,9.2750000000000004,9.2750000000000004,9.2750000000000004,9.2750000000000004]
[70,"70",null,9.2750000000000004,9.2750000000000004,9.2750000000000004,9.2750000000000004,9.2750000000000004]
[71,"71",null,9.2750000000000004,9.2750000000000004,9.2750000000000004,9.2750000000000004,9.2750000000000004]
[72,"72",null,{"$f":"+D533*$G$2","v":9.2750000000000004},9.2750000000000004,9.2750000000000004,9.2750000000000004,9.2750000000000004]
[73,"73",null,9.2750000000000004,9.2750000000000004,9.2750000000000004,9.2750000000000004,9.2750000000000004]
[74,"74",null,9.2750000000000004,9.2750000000000004,9.2750000000000004,9.2750000000000004,9.2750000000000004]
[75,"75+",null,9.2750000000000004,9.2750000000000004,9.2750000000000004,9.2750000000000004,9.2750000000000004]
[1,"1 Child",null,0,0,0,0,0]
[2,"2 Children",null,0,0,0,0,0]
[3,"3+ Children",null,0,0,0,0,0]
[1,"Rider Comp. Maternidad",null,119.25,119.25,119.25,119.25,119.25]
[1,"Transplante de organos",null,159,159,159,159,159]
[]
[]
[]
[]
[]
["CRITICAL"]
["TARIFAS ANUALES",null,null,null,null,null,null,null,null,null,null,null,null,null,null,null,null,null,null,null,null,"ORIGINAL RATES",null,null,null,null,null,null,null,null,null,null,null,null,null,null,null,null,null,null,null,null,"DISCOUNTS APPLIED"]
["EDAD"]
[" "," ","CR1",null,null,"CR2",null,null,"CR3",null,null,"CR4",null,null,"CR5",null,null,"CR6",null,null,null," "," ","CR1",null,null,"CR2",null,null,"CR3",null,null,"CR4",null,null,"CR5",null,null,"CR6",null,null,null," "," ","CR1",null,null,"CR2",null,null,"CR3",null,null,"CR4",null,null,"CR5",null,null,"CR6"]
[null,null,"INDIVIDUAL","2 PERSONAS","FAMILIAR","INDIVIDUAL","2 PERSONAS","FAMILIAR","INDIVIDUAL","2 PERSONAS","FAMILIAR","INDIVIDUAL","2 PERSONAS","FAMILIAR","INDIVIDUAL","2 PERSONAS","FAMILIAR","INDIVIDUAL","2 PERSONAS","FAMILIAR",null,null,null,"INDIVIDUAL","2 PERSONAS","FAMILIAR","INDIVIDUAL","2 PERSONAS","FAMILIAR","INDIVIDUAL","2 PERSONAS","FAMILIAR","INDIVIDUAL","2 PERSONAS","FAMILIAR","INDIVIDUAL","2 PERSONAS","FAMILIAR","INDIVIDUAL","2 PERSONAS","FAMILIAR",null,null,null,"INDIVIDUAL","2 PERSONAS","FAMILIAR","INDIVIDUAL","2 PERSONAS","FAMILIAR","INDIVIDUAL","2 PERSONAS","FAMILIAR","INDIVIDUAL","2 PERSONAS","FAMILIAR","INDIVIDUAL","2 PERSONAS","FAMILIAR","INDIVIDUAL","2 PERSONAS","FAMILIAR"]
[18,"-  49",{"$f":"AS587","v":0},{"$f":"AT587","v":0},0,0,0,0,0,0,0,0,0,0,0,0,0,{"$f":"BH587","v":0},{"$f":"BI587","v":0},{"$f":"BJ587","v":0},null,18,"-  49",{"$f":"IF($C$2=2,Venezuela!C587,IF($C$2=3,#REF!,IF($C$2=4,#REF!,IF($C$2=5,#REF!,IF($C$2=6,#REF!,IF($C$2=8,#REF!,IF($C$2=9,#REF!,IF($C$2=\"PERU2020\",#REF!))))))))","v":false},{"$f":"IF($C$2=2,Venezuela!D587,IF($C$2=3,#REF!,IF($C$2=4,#REF!,IF($C$2=5,#REF!,IF($C$2=6,#REF!,IF($C$2=8,#REF!,IF($C$2=9,#REF!,IF($C$2=\"PERU2020\",#REF!))))))))","v":false},{"$f":"IF($C$2=2,Venezuela!E587,IF($C$2=3,#REF!,IF($C$2=4,#REF!,IF($C$2=5,#REF!,IF($C$2=6,#REF!,IF($C$2=8,#REF!,IF($C$2=9,#REF!,IF($C$2=\"PERU2020\",#REF!))))))))","v":false},{"$f":"IF($C$2=2,Venezuela!F587,IF($C$2=3,#REF!,IF($C$2=4,#REF!,IF($C$2=5,#REF!,IF($C$2=6,#REF!,IF($C$2=8,#REF!,IF($C$2=9,#REF!,IF($C$2=\"PERU2020\",#REF!))))))))","v":false},{"$f":"IF($C$2=2,Venezuela!G587,IF($C$2=3,#REF!,IF($C$2=4,#REF!,IF($C$2=5,#REF!,IF($C$2=6,#REF!,IF($C$2=8,#REF!,IF($C$2=9,#REF!,IF($C$2=\"PERU2020\",#REF!))))))))","v":false},{"$f":"IF($C$2=2,Venezuela!H587,IF($C$2=3,#REF!,IF($C$2=4,#REF!,IF($C$2=5,#REF!,IF($C$2=6,#REF!,IF($C$2=8,#REF!,IF($C$2=9,#REF!,IF($C$2=\"PERU2020\",#REF!))))))))","v":false},{"$f":"IF($C$2=2,Venezuela!I587,IF($C$2=3,#REF!,IF($C$2=4,#REF!,IF($C$2=5,#REF!,IF($C$2=6,#REF!,IF($C$2=8,#REF!,IF($C$2=9,#REF!,IF($C$2=\"PERU2020\",#REF!))))))))","v":false},{"$f":"IF($C$2=2,Venezuela!J587,IF($C$2=3,#REF!,IF($C$2=4,#REF!,IF($C$2=5,#REF!,IF($C$2=6,#REF!,IF($C$2=8,#REF!,IF($C$2=9,#REF!,IF($C$2=\"PERU2020\",#REF!))))))))","v":false},{"$f":"IF($C$2=2,Venezuela!K587,IF($C$2=3,#REF!,IF($C$2=4,#REF!,IF($C$2=5,#REF!,IF($C$2=6,#REF!,IF($C$2=8,#REF!,IF($C$2=9,#REF!,IF($C$2=\"PERU2020\",#REF!))))))))","v":false},{"$f":"IF($C$2=2,Venezuela!L587,IF($C$2=3,#REF!,IF($C$2=4,#REF!,IF($C$2=5,#REF!,IF($C$2=6,#REF!,IF($C$2=8,#REF!,IF($C$2=9,#REF!,IF($C$2=\"PERU2020\",#REF!))))))))","v":false},{"$f":"IF($C$2=2,Venezuela!M587,IF($C$2=3,#REF!,IF($C$2=4,#REF!,IF($C$2=5,#REF!,IF($C$2=6,#REF!,IF($C$2=8,#REF!,IF($C$2=9,#REF!,IF($C$2=\"PERU2020\",#REF!))))))))","v":false},{"$f":"IF($C$2=2,Venezuela!N587,IF($C$2=3,#REF!,IF($C$2=4,#REF!,IF($C$2=5,#REF!,IF($C$2=6,#REF!,IF($C$2=8,#REF!,IF($C$2=9,#REF!,IF($C$2=\"PERU2020\",#REF!))))))))","v":false},{"$f":"IF($C$2=2,Venezuela!O587,IF($C$2=3,#REF!,IF($C$2=4,#REF!,IF($C$2=5,#REF!,IF($C$2=6,#REF!,IF($C$2=8,#REF!,IF($C$2=9,#REF!,IF($C$2=\"PERU2020\",#REF!))))))))","v":false},{"$f":"IF($C$2=2,Venezuela!P587,IF($C$2=3,#REF!,IF($C$2=4,#REF!,IF($C$2=5,#REF!,IF($C$2=6,#REF!,IF($C$2=8,#REF!,IF($C$2=9,#REF!,IF($C$2=\"PERU2020\",#REF!))))))))","v":false},{"$f":"IF($C$2=2,Venezuela!Q587,IF($C$2=3,#REF!,IF($C$2=4,#REF!,IF($C$2=5,#REF!,IF($C$2=6,#REF!,IF($C$2=8,#REF!,IF($C$2=9,#REF!,IF($C$2=\"PERU2020\",#REF!))))))))","v":false},{"$f":"IF($C$2=2,Venezuela!R587,IF($C$2=3,#REF!,IF($C$2=4,#REF!,IF($C$2=5,#REF!,IF($C$2=6,#REF!,IF($C$2=8,#REF!,IF($C$2=9,#REF!,IF($C$2=\"PERU2020\",#REF!))))))))","v":false},{"$f":"IF($C$2=2,Venezuela!S587,IF($C$2=3,#REF!,IF($C$2=4,#REF!,IF($C$2=5,#REF!,IF($C$2=6,#REF!,IF($C$2=8,#REF!,IF($C$2=9,#REF!,IF($C$2=\"PERU2020\",#REF!))))))))","v":false},{"$f":"IF($C$2=2,Venezuela!T587,IF($C$2=3,#REF!,IF($C$2=4,#REF!,IF($C$2=5,#REF!,IF($C$2=6,#REF!,IF($C$2=8,#REF!,IF($C$2=9,#REF!,IF($C$2=\"PERU2020\",#REF!))))))))","v":false},null,18,"-  49",{"$f":"X587*$K$2","v":0},{"$f":"Y587*$K$2","v":0},0,0,0,0,0,0,0,0,0,0,0,0,0,0,0,0]
[50,"o más",{"$f":"AS588","v":0},{"$f":"AT588","v":0},{"$f":"AU588","v":0},{"$f":"AV588","v":0},{"$f":"AW588","v":0},{"$f":"AX588","v":0},{"$f":"AY588","v":0},{"$f":"AZ588","v":0},{"$f":"BA588","v":0},{"$f":"BB588","v":0},{"$f":"BC588","v":0},{"$f":"BD588","v":0},{"$f":"BE588","v":0},{"$f":"BF588","v":0},{"$f":"BG588","v":0},0,0,0,null,50,"o más",{"$f":"IF($C$2=2,Venezuela!C588,IF($C$2=3,#REF!,IF($C$2=4,#REF!,IF($C$2=5,#REF!,IF($C$2=6,#REF!,IF($C$2=8,#REF!,IF($C$2=9,#REF!,IF($C$2=\"PERU2020\",#REF!))))))))","v":false},{"$f":"IF($C$2=2,Venezuela!D588,IF($C$2=3,#REF!,IF($C$2=4,#REF!,IF($C$2=5,#REF!,IF($C$2=6,#REF!,IF($C$2=8,#REF!,IF($C$2=9,#REF!,IF($C$2=\"PERU2020\",#REF!))))))))","v":false},{"$f":"IF($C$2=2,Venezuela!E588,IF($C$2=3,#REF!,IF($C$2=4,#REF!,IF($C$2=5,#REF!,IF($C$2=6,#REF!,IF($C$2=8,#REF!,IF($C$2=9,#REF!,IF($C$2=\"PERU2020\",#REF!))))))))","v":false},{"$f":"IF($C$2=2,Venezuela!F588,IF($C$2=3,#REF!,IF($C$2=4,#REF!,IF($C$2=5,#REF!,IF($C$2=6,#REF!,IF($C$2=8,#REF!,IF($C$2=9,#REF!,IF($C$2=\"PERU2020\",#REF!))))))))","v":false},{"$f":"IF($C$2=2,Venezuela!G588,IF($C$2=3,#REF!,IF($C$2=4,#REF!,IF($C$2=5,#REF!,IF($C$2=6,#REF!,IF($C$2=8,#REF!,IF($C$2=9,#REF!,IF($C$2=\"PERU2020\",#REF!))))))))","v":false},{"$f":"IF($C$2=2,Venezuela!H588,IF($C$2=3,#REF!,IF($C$2=4,#REF!,IF($C$2=5,#REF!,IF($C$2=6,#REF!,IF($C$2=8,#REF!,IF($C$2=9,#REF!,IF($C$2=\"PERU2020\",#REF!))))))))","v":false},{"$f":"IF($C$2=2,Venezuela!I588,IF($C$2=3,#REF!,IF($C$2=4,#REF!,IF($C$2=5,#REF!,IF($C$2=6,#REF!,IF($C$2=8,#REF!,IF($C$2=9,#REF!,IF($C$2=\"PERU2020\",#REF!))))))))","v":false},{"$f":"IF($C$2=2,Venezuela!J588,IF($C$2=3,#REF!,IF($C$2=4,#REF!,IF($C$2=5,#REF!,IF($C$2=6,#REF!,IF($C$2=8,#REF!,IF($C$2=9,#REF!,IF($C$2=\"PERU2020\",#REF!))))))))","v":false},{"$f":"IF($C$2=2,Venezuela!K588,IF($C$2=3,#REF!,IF($C$2=4,#REF!,IF($C$2=5,#REF!,IF($C$2=6,#REF!,IF($C$2=8,#REF!,IF($C$2=9,#REF!,IF($C$2=\"PERU2020\",#REF!))))))))","v":false},{"$f":"IF($C$2=2,Venezuela!L588,IF($C$2=3,#REF!,IF($C$2=4,#REF!,IF($C$2=5,#REF!,IF($C$2=6,#REF!,IF($C$2=8,#REF!,IF($C$2=9,#REF!,IF($C$2=\"PERU2020\",#REF!))))))))","v":false},{"$f":"IF($C$2=2,Venezuela!M588,IF($C$2=3,#REF!,IF($C$2=4,#REF!,IF($C$2=5,#REF!,IF($C$2=6,#REF!,IF($C$2=8,#REF!,IF($C$2=9,#REF!,IF($C$2=\"PERU2020\",#REF!))))))))","v":false},{"$f":"IF($C$2=2,Venezuela!N588,IF($C$2=3,#REF!,IF($C$2=4,#REF!,IF($C$2=5,#REF!,IF($C$2=6,#REF!,IF($C$2=8,#REF!,IF($C$2=9,#REF!,IF($C$2=\"PERU2020\",#REF!))))))))","v":false},{"$f":"IF($C$2=2,Venezuela!O588,IF($C$2=3,#REF!,IF($C$2=4,#REF!,IF($C$2=5,#REF!,IF($C$2=6,#REF!,IF($C$2=8,#REF!,IF($C$2=9,#REF!,IF($C$2=\"PERU2020\",#REF!))))))))","v":false},{"$f":"IF($C$2=2,Venezuela!P588,IF($C$2=3,#REF!,IF($C$2=4,#REF!,IF($C$2=5,#REF!,IF($C$2=6,#REF!,IF($C$2=8,#REF!,IF($C$2=9,#REF!,IF($C$2=\"PERU2020\",#REF!))))))))","v":false},{"$f":"IF($C$2=2,Venezuela!Q588,IF($C$2=3,#REF!,IF($C$2=4,#REF!,IF($C$2=5,#REF!,IF($C$2=6,#REF!,IF($C$2=8,#REF!,IF($C$2=9,#REF!,IF($C$2=\"PERU2020\",#REF!))))))))","v":false},{"$f":"IF($C$2=2,Venezuela!R588,IF($C$2=3,#REF!,IF($C$2=4,#REF!,IF($C$2=5,#REF!,IF($C$2=6,#REF!,IF($C$2=8,#REF!,IF($C$2=9,#REF!,IF($C$2=\"PERU2020\",#REF!))))))))","v":false},{"$f":"IF($C$2=2,Venezuela!S588,IF($C$2=3,#REF!,IF($C$2=4,#REF!,IF($C$2=5,#REF!,IF($C$2=6,#REF!,IF($C$2=8,#REF!,IF($C$2=9,#REF!,IF($C$2=\"PERU2020\",#REF!))))))))","v":false},{"$f":"IF($C$2=2,Venezuela!T588,IF($C$2=3,#REF!,IF($C$2=4,#REF!,IF($C$2=5,#REF!,IF($C$2=6,#REF!,IF($C$2=8,#REF!,IF($C$2=9,#REF!,IF($C$2=\"PERU2020\",#REF!))))))))","v":false},null,50,"o más",{"$f":"X588*$K$2","v":0},{"$f":"Y588*$K$2","v":0},{"$f":"Z588*$K$2","v":0},{"$f":"AA588*$K$2","v":0},{"$f":"AB588*$K$2","v":0},{"$f":"AC588*$K$2","v":0},{"$f":"AD588*$K$2","v":0},{"$f":"AE588*$K$2","v":0},{"$f":"AF588*$K$2","v":0},{"$f":"AG588*$K$2","v":0},{"$f":"AH588*$K$2","v":0},{"$f":"AI588*$K$2","v":0},{"$f":"AJ588*$K$2","v":0},{"$f":"AK588*$K$2","v":0},{"$f":"AL588*$K$2","v":0},{"$f":"AM588*$K$2","v":0},{"$f":"AN588*$K$2","v":0},{"$f":"AO588*$K$2","v":0}]
[]
["TARIFAS SEMESTRALES ",null,null,null,null,null,null,null,null,null,null,null,null,null,null,null,null,null,null,null,null,"TARIFAS SEMESTRALES ",null,null,null,null,null,null,null,null,null,null,null,null,null,null,null,null,null,null,null,null,"TARIFAS SEMESTRALES "]
["EDAD",null,null,null,null,null,null,null,null,null,null,null,null,null,null,null,null,null,null,null,null,"EDAD",null,null,null,null,null,null,null,null,null,null,null,null,null,null,null,null,null,null,null,null,"EDAD"]
[" "," ","CR1",null,null,"CR2",null,null,"CR3",null,null,"CR4",null,null,"CR5",null,null,"CR6",null,null,null," "," ","CR1",null,null,"CR2",null,null,"CR3",null,null,"CR4",null,null,"CR5",null,null,"CR6",null,null,null," "," ","CR1",null,null,"CR2",null,null,"CR3",null,null,"CR4",null,null,"CR5",null,null,"CR6"]
[null,null,"INDIVIDUAL","2 PERSONAS","FAMILIAR","INDIVIDUAL","2 PERSONAS","FAMILIAR","INDIVIDUAL","2 PERSONAS","FAMILIAR","INDIVIDUAL","2 PERSONAS","FAMILIAR","INDIVIDUAL","2 PERSONAS","FAMILIAR","INDIVIDUAL","2 PERSONAS","FAMILIAR",null,null,null,"INDIVIDUAL","2 PERSONAS","FAMILIAR","INDIVIDUAL","2 PERSONAS","FAMILIAR","INDIVIDUAL","2 PERSONAS","FAMILIAR","INDIVIDUAL","2 PERSONAS","FAMILIAR","INDIVIDUAL","2 PERSONAS","FAMILIAR","INDIVIDUAL","2 PERSONAS","FAMILIAR",null,null,null,"INDIVIDUAL","2 PERSONAS","FAMILIAR","INDIVIDUAL","2 PERSONAS","FAMILIAR","INDIVIDUAL","2 PERSONAS","FAMILIAR","INDIVIDUAL","2 PERSONAS","FAMILIAR","INDIVIDUAL","2 PERSONAS","FAMILIAR","INDIVIDUAL","2 PERSONAS","FAMILIAR"]
[18,"-  49",{"$f":"AS594","v":0},{"$f":"AT594","v":0},0,0,0,0,0,0,0,0,0,0,0,0,0,{"$f":"BH594","v":0},{"$f":"BI594","v":0},{"$f":"BJ594","v":0},null,18,"-  49",{"$f":"+X587*$G$2","v":0},0,0,0,0,0,0,0,0,0,0,0,0,0,0,0,0,0,null,18,"-  25",{"$f":"+AS587*$G$2","v":0},0,0,0,0,0,0,0,0,0,0,0,0,0,0,0,0,0]
[50,"o más",{"$f":"AS595","v":0},{"$f":"AT595","v":0},{"$f":"AU595","v":0},{"$f":"AV595","v":0},{"$f":"AW595","v":0},{"$f":"AX595","v":0},{"$f":"AY595","v":0},{"$f":"AZ595","v":0},{"$f":"BA595","v":0},{"$f":"BB595","v":0},{"$f":"BC595","v":0},{"$f":"BD595","v":0},{"$f":"BE595","v":0},{"$f":"BF595","v":0},{"$f":"BG595","v":0},0,0,0,null,50,"o más",{"$f":"+X588*$G$2","v":0},0,0,0,0,0,0,0,0,0,0,0,0,0,0,0,0,0,null,75,"o más",{"$f":"+AS588*$G$2","v":0},0,0,0,0,0,0,0,0,0,0,0,0,0,0,0,0,0]

{"sheet":"Venezuela","index":7,"n_rows":596,"n_cols":20,"rows_kept":596,"cut":false,"hidden":true,"merged":[[1,8,1,9],[4,0,4,7],[4,10,4,11],[5,0,5,7],[5,16,5,17],[6,0,6,1],[6,2,6,6],[111,0,111,7],[112,0,112,1],[112,2,112,6],[147,0,147,7],[148,0,148,7],[149,0,149,1],[149,2,149,6],[40,0,40,7],[41,0,41,1],[41,2,41,6],[77,0,77,7],[78,0,78,7],[79,0,79,1],[79,2,79,6],[253,0,253,7],[254,0,254,1],[254,2,254,6],[292,0,292,7],[293,0,293,7],[294,0,294,1],[294,2,294,6],[183,0,183,7],[184,0,184,1],[184,2,184,6],[219,0,219,7],[220,0,220,7],[221,0,221,1],[221,2,221,6],[399,0,399,7],[400,0,400,1],[400,2,400,6],[435,0,435,7],[436,0,436,7],[437,0,437,1],[437,2,437,6],[328,0,328,7],[329,0,329,1],[329,2,329,6],[365,0,365,7],[366,0,366,7],[367,0,367,1],[367,2,367,6],[544,0,544,7],[545,0,545,1],[545,2,545,6],[583,0,583,1],[583,2,583,6],[472,0,472,7],[473,0,473,1],[473,2,473,6],[508,0,508,7],[509,0,509,7],[510,0,510,1],[510,2,510,6],[582,0,582,19],[581,0,581,19],[591,38,591,39],[591,40,591,44],[584,46,584,48],[584,49,584,51],[584,52,584,54],[590,0,590,16],[590,19,590,35],[590,38,590,54],[584,24,584,26],[584,27,584,29],[584,30,584,32],[584,33,584,35],[584,40,584,42],[584,43,584,45],[584,2,584,4],[584,5,584,7],[584,8,584,10],[584,11,584,13],[584,14,584,16],[584,21,584,23],[584,17,584,19],[592,2,592,4],[592,5,592,7],[592,8,592,10],[592,11,592,13],[592,14,592,16],[592,21,592,23],[591,0,591,1],[591,2,591,6],[591,19,591,20],[591,21,591,25],[592,46,592,48],[592,49,592,51],[592,52,592,54],[592,24,592,26],[592,27,592,29],[592,30,592,32],[592,33,592,35],[592,40,592,42],[592,43,592,45]]}
[null,null,null,null,null,null,null,null,null,null,"D1","D2","D3","D4","D5","D6"]
[null,"REGIÓN",{"$f":"'INGRESO DE DATOS'!W14","v":"VENEZUELA"},null,"FACTOR SEMESTRAL :",null,0.53,null,"NEW BUSINESS DISCUOUNTS",null,{"$f":"'INGRESO DE DATOS'!O42","v":0.65},{"$f":"'INGRESO DE DATOS'!P42","v":0.65},{"$f":"'INGRESO DE DATOS'!Q42","v":0.65},{"$f":"'INGRESO DE DATOS'!R42","v":0.65},{"$f":"'INGRESO DE DATOS'!S42","v":0.65},{"$f":"'INGRESO DE DATOS'!T42","v":0.65}]
[]
[]
["BUPA EXCLUSIVE CARE"]
["TARIFAS ANUALES"]
["EDAD"]
[" "," ","DW1","DW2","DW3","DW4","DW5","DW6"]
[18,"18-24",null,19965,13185,8718,6125,4814]
[25,"25-29",null,20940,14572,9655,6792,5334]
[30,"30-34",null,21790,15636,10819,8141,6415]
[35,"35-39",null,24398,17502,12135,9131,7187]
[40,"40-44",null,28288,19152,13465,10046,7902]
[45,"45-49",null,31632,21417,15053,11232,8843]
[50,"50-54",null,40486,28113,19652,15868,12505]
[55,"55-59",null,43082,29915,20911,16891,13315]
[60,"60",null,46936,32645,24069,20355,16547]
[61,"61",null,50427,35072,25850,21883,17783]
[62,"62",null,55211,38418,28311,23950,19476]
[63,"63",null,58707,40844,30099,25476,20708]
[64,"64",null,63513,44201,32571,27561,22416]
[65,"65",null,83034,57657,41193,36767,31620]
[66,"66",null,96467,67010,47873,42741,36743]
[67,"67",null,105370,73186,52294,46671,40139]
[68,"68",null,116679,81039,57900,51695,44452]
[69,"69",null,128381,89160,63712,56874,48918]
[70,"70",null,158016,108580,75013,66291,57541]
[71,"71",null,164217,112839,77957,68894,59805]
[72,"72",null,168872,116034,80156,70838,61500]
[73,"73",null,175073,120305,83099,73456,63765]
[74,"74",null,178175,122426,84585,74752,64887]
[75,"75+",null,185937,127756,88256,78010,67715]
[1,"1 Child",null,6945,5115,3907,3266,2546]
[2,"2 Children",null,11045,8147,6216,5185,4031]
[3,"3+ Children",null,16193,11945,9101,7597,5911]
[1,"Rider Comp. Maternidad",null,0,0,225,225,225]
[1,"Transplante de organos",null,0,0,0,0,0]
[]
[]
[]
["TARIFAS SEMESTRALES "]
["EDAD"]
[" "," ",null,"DW2","DW3","DW4","DW5","DW6"]
[18,"18-24",null,{"$f":"$G$2*D9","v":10581.45},6988.05,4620.54,3246.25,2551.42]
[25,"25-29",null,11098.2,7723.1600000000008,5117.1500000000005,3599.76,2827.02]
[30,"30-34",null,11548.7,8287.08,5734.0700000000006,4314.7300000000005,3399.9500000000003]
[35,"35-39",null,12930.94,9276.0600000000013,6431.55,4839.43,3809.11]
[40,"40-44",null,14992.640000000001,10150.560000000001,7136.4500000000007,5324.38,4188.0600000000004]
[45,"45-49",null,16764.96,11351.01,7978.09,5952.96,4686.79]
[50,"50-54",null,21457.58,14899.890000000001,10415.560000000001,8410.0400000000009,6627.6500000000005]
[55,"55-59",null,22833.460000000003,15854.95,11082.83,8952.23,7056.9500000000007]
[60,"60",null,24876.080000000002,17301.850000000002,12756.570000000002,10788.15,8769.91]
[61,"61",null,26726.31,18588.16,13700.5,11597.99,9424.99]
[62,"62",null,{"$f":"$G$2*D19","v":29261.83},20361.54,15004.83,12693.5,10322.280000000001]
[63,"63",null,31114.710000000003,21647.32,15952.470000000001,13502.28,10975.24]
[64,"64",null,33661.89,23426.530000000002,17262.63,14607.33,11880.480000000001]
[65,"65",null,44008.020000000004,30558.210000000003,21832.29,19486.510000000002,16758.600000000002]
[66,"66",null,51127.51,35515.300000000003,25372.690000000002,22652.73,19473.79]
[67,"67",null,55846.100000000006,38788.58,27715.82,24735.63,21273.670000000002]
[68,"68",null,61839.87,42950.670000000006,30687,27398.350000000002,23559.56]
[69,"69",null,68041.930000000008,47254.8,33767.360000000001,30143.22,25926.54]
[70,"70",null,83748.48000000001,57547.4,39756.89,35134.230000000003,30496.730000000003]
[71,"71",null,87035.010000000009,59804.670000000006,41317.21,36513.82,31696.65]
[72,"72",null,{"$f":"$G$2*D29","v":89502.16},61498.020000000004,42482.68,37544.14,32595]
[73,"73",null,92788.69,63761.65,44042.47,38931.68,33795.450000000004]
[74,"74",null,94432.75,64885.780000000006,44830.05,39618.560000000005,34390.11]
[75,"75+",null,98546.61,67710.680000000008,46775.68,41345.300000000003,35888.950000000004]
[1,"1 Child",null,3680.8500000000004,2710.9500000000003,2070.71,1730.98,1349.38]
[2,"2 Children",null,5853.85,4317.91,3294.48,2748.05,2136.4300000000003]
[3,"3+ Children",null,8582.2900000000009,6330.85,4823.5300000000007,4026.4100000000003,3132.8300000000004]
[1,"Rider Comp. Maternidad",null,{"$f":"+D36*$G$2","v":0},0,119.25,119.25,119.25]
[1,"Transplante de organos",null,0,0,0,0,0]
[]
[]
[]
[]
[]
["DIAMOND (LATINAMERICA ONLY)"]
["TARIFAS ANUALES"]
["EDAD"]
[" "," ","DL1","DL2","DL3","DL4","DL5","DL6"]
[18,"-  24"]
[25,"-  29"]
[30,"-  34"]
[35,"-  39"]
[40,"-  44"]
[45,"-  49"]
[50,"-  54"]
[55,"-  59"]
[60]
[61]
[62]
[63]
[64]
[65]
[66]
[67]
[68]
[69]
[70]
[71]
[72]
[73]
[74]
[75,"o más"]
[1,"Hijo"]
[2,"Hijos"]
[3,"Hijos o más"]
[1,"Rider Comp. Maternidad"]
[1,"Transplante de organos",0,0,0,0,0,0]
[]
["TARIFAS SEMESTRALES "]
["EDAD"]
[" "," ","DL1","DL2","DL3","DL4","DL5","DL6"]
[18,"-  24",{"$f":"+C82*$G$2","v":0},0,0,0,0,0]
[25,"-  29",0,0,0,0,0,0]
[30,"-  34",0,0,0,0,0,0]
[35,"-  39",0,0,0,0,0,0]
[40,"-  44",0,0,0,0,0,0]
[45,"-  49",0,0,0,0,0,0]
[50,"-  54",0,0,0,0,0,0]
[55,"-  59",0,0,0,0,0,0]
[60,null,0,0,0,0,0,0]
[61,null,0,0,0,0,0,0]
[62,null,{"$f":"+C92*$G$2","v":0},0,0,0,0,0]
[63,null,0,0,0,0,0,0]
[64,null,0,0,0,0,0,0]
[65,null,0,0,0,0,0,0]
[66,null,0,0,0,0,0,0]
[67,null,0,0,0,0,0,0]
[68,null,0,0,0,0,0,0]
[69,null,0,0,0,0,0,0]
[70,null,0,0,0,0,0,0]
[71,null,0,0,0,0,0,0]
[72,null,{"$f":"+C102*$G$2","v":0},0,0,0,0,0]
[73,null,0,0,0,0,0,0]
[74,null,0,0,0,0,0,0]
[75,"o más",0,0,0,0,0,0]
[1,"Hijo",0,0,0,0,0,0]
[2,"Hijos",0,0,0,0,0,0]
[3,"Hijos o más",0,0,0,0,0,0]
[1,"Rider Comp. Maternidad",0,0,0,0,0,0]
[1,"Transplante de organos",0,0,0,0,0,0]
[]
[]
[]
[]
["BUPA PRIVILEGE CARE INTEERNATIONAL"]
["TARIFAS ANUALES"]
["EDAD"]
[" "," ","CW1","CW2","CW3","CW4","CW5","CW6"]
[18,"18-24",null,3066,2179,1545,1174]
[25,"25-29",null,3397,2414,1711,1305]
[30,"30-34",null,3809,2707,2072,1581]
[35,"35-39",null,4263,3031,2320,1772]
[40,"40-44",null,4741,3370,2557,1952]
[45,"45-49",null,5301,3770,2857,2183]
[50,"50-54",null,6958,4946,4079,3118]
[55,"55-59",null,7404,5263,4339,3320]
[60,"60",null,8423,5988,5161,4143]
[61,"61",null,9048,6432,5545,4450]
[62,"62",null,9909,7045,6070,4875]
[63,"63",null,10532,7488,6453,5184]
[64,"64",null,11393,8099,6982,5608]
[65,"65",null,14405,10240,9306,7907]
[66,"66",null,16739,11899,10816,9187]
[67,"67",null,18282,12995,11813,10031]
[68,"68",null,20245,14392,13084,11107]
[69,"69",null,22275,15835,14392,12223]
[70,"70",null,26213,18633,16770,14374]
[71,"71",null,27247,19369,17426,14937]
[72,"72",null,28016,19915,17922,15362]
[73,"73",null,29048,20649,18578,15929]
[74,"74",null,29555,21009,18908,16209]
[75,"75+",null,30846,21927,19730,16913]
[1,"1 Child",null,1247,888,748,554]
[2,"2 Children",null,1980,1408,1189,878]
[3,"3+ Children",null,2903,2063,1743,1287]
[1,"Rider Comp. Maternidad",null,0,0,225,225]
[1,"Transplante de organos",null,0,0,0,0]
[]
[]
[]
["TARIFAS SEMESTRALES "]
["EDAD"]
[" "," ",null,"CW2","CW3","CW4","CW5","CW6"]
[18,"18-24",null,{"$f":"$G$2*D152","v":1624.98},1154.8700000000001,818.85,622.22,0]
[25,"25-29",null,1800.41,1279.42,906.83,691.65000000000009,0]
[30,"30-34",null,2018.7700000000002,1434.71,1098.1600000000001,837.93000000000006,0]
[35,"35-39",null,2259.3900000000003,1606.43,1229.6000000000001,939.16000000000008,0]
[40,"40-44",null,2512.73,1786.1000000000001,1355.21,1034.56,0]
[45,"45-49",null,2809.53,1998.1000000000001,1514.21,1156.99,0]
[50,"50-54",null,3687.7400000000002,2621.38,2161.87,1652.5400000000002,0]
[55,"55-59",null,3924.1200000000003,2789.3900000000003,2299.67,1759.6000000000001,0]
[60,"60",null,4464.1900000000005,3173.6400000000003,2735.33,2195.79,0]
[61,"61",null,4795.4400000000005,3408.96,2938.8500000000004,2358.5,0]
[62,"62",null,{"$f":"$G$2*D162","v":5251.77},3733.8500000000004,3217.1000000000004,2583.75,0]
[63,"63",null,5581.96,3968.6400000000003,3420.09,2747.52,0]
[64,"64",null,6038.29,4292.47,3700.46,2972.2400000000002,0]
[65,"65",null,7634.6500000000005,5427.2000000000007,4932.18,4190.71,0]
[66,"66",null,8871.67,6306.47,5732.4800000000005,4869.1100000000006,0]
[67,"67",null,9689.4600000000009,6887.35,6260.89,5316.43,0]
[68,"68",null,10729.85,7627.76,6934.52,5886.71,0]
[69,"69",null,11805.75,8392.5500000000011,7627.76,6478.1900000000005,0]
[70,"70",null,13892.890000000001,9875.49,8888.1,7618.22,0]
[71,"71",null,14440.91,10265.57,9235.7800000000007,7916.6100000000006,0]
[72,"72",null,{"$f":"$G$2*D172","v":14848.480000000001},10554.95,9498.66,8141.8600000000006,0]
[73,"73",null,15395.44,10943.970000000001,9846.34,8442.3700000000008,0]
[74,"74",null,15664.150000000001,11134.77,10021.24,8590.77,0]
[75,"75+",null,16348.380000000001,11621.310000000001,10456.9,8963.8900000000012,0]
[1,"1 Child",null,660.91000000000008,470.64000000000004,396.44,293.62,0]
[2,"2 Children",null,1049.4000000000001,746.24,630.17000000000007,465.34000000000003,0]
[3,"3+ Children",null,1538.5900000000001,1093.3900000000001,923.79000000000008,682.11,0]
[1,"Rider Comp. Maternidad",null,{"$f":"+D179*$G$2","v":0},0,119.25,119.25,0]
[1,"Transplante de organos",null,0,0,0,0,0]
[]
[]
[]
[]
["COMPLETE (LATINAMERICA ONLY)"]
["TARIFAS ANUALES"]
["EDAD"]
[" "," ","CL1","CL2","CL3","CL4","CL5","CL6"]
[18,"-  24"]
[25,"-  29"]
[30,"-  34"]
[35,"-  39"]
[40,"-  44"]
[45,"-  49"]
[50,"-  54"]
[55,"-  59"]
[60]
[61]
[62]
[63]
[64]
[65]
[66]
[67]
[68]
[69]
[70]
[71]
[72]
[73]
[74]
[75,"o más"]
[1,"Hijo"]
[2,"Hijos"]
[3,"Hijos o más"]
[1,"Rider Comp. Maternidad"]
[1,"Transplante de organos",0,0,0,0,0,0]
[]
["TARIFAS SEMESTRALES "]
["EDAD"]
[" "," ","CL1","CL2","CL3","CL4","CL5","CL6"]
[18,"-  24",{"$f":"+C224*$G$2","v":0},0,0,0,0,0]
[25,"-  29",0,0,0,0,0,0]
[30,"-  34",0,0,0,0,0,0]
[35,"-  39",0,0,0,0,0,0]
[40,"-  44",0,0,0,0,0,0]
[45,"-  49",0,0,0,0,0,0]
[50,"-  54",0,0,0,0,0,0]
[55,"-  59",0,0,0,0,0,0]
[60,null,0,0,0,0,0,0]
[61,null,0,0,0,0,0,0]
[62,null,{"$f":"+C234*$G$2","v":0},0,0,0,0,0]
[63,null,0,0,0,0,0,0]
[64,null,0,0,0,0,0,0]
[65,null,0,0,0,0,0,0]
[66,null,0,0,0,0,0,0]
[67,null,0,0,0,0,0,0]
[68,null,0,0,0,0,0,0]
[69,null,0,0,0,0,0,0]
[70,null,0,0,0,0,0,0]
[71,null,0,0,0,0,0,0]
[72,null,{"$f":"+C244*$G$2","v":0},0,0,0,0,0]
[73,null,0,0,0,0,0,0]
[74,null,0,0,0,0,0,0]
[75,"o más",0,0,0,0,0,0]
[1,"Hijo",0,0,0,0,0,0]
[2,"Hijos",0,0,0,0,0,0]
[3,"Hijos o más",0,0,0,0,0,0]
[1,"Rider Comp. Maternidad",0,0,0,0,0,0]
[1,"Transplante de organos",0,0,0,0,0,0]
[]
[]
[]
[]
[]
[]
[]
["BUPA ADVANTAGE CARE (WORLDWIDE)"]
["TARIFAS ANUALES"]
["EDAD"]
[" "," ",null,"AW2","AW3","AW4","AW5","AW6"]
[18,"18-24",null,11274,8468,6008,4524,3596]
[25,"25-29",null,12539,9454,6697,5057,3984]
[30,"30-34",null,14513,11113,7965,6006,4628]
[35,"35-39",null,16087,12364,8855,6837,5127]
[40,"40-44",null,18158,14021,10049,7643,5808]
[45,"45-49",null,21085,16143,11320,8701,6741]
[50,"50-54",null,23113,18149,13192,9759,7405]
[55,"55-59",null,27316,20952,14591,11309,8752]
[60,"60",null,30177,23199,16056,12470,9692]
[61,"61",null,33962,26114,18072,14044,10917]
[62,"62",null,37746,29025,20086,15620,12140]
[63,"63",null,41524,31932,22115,17187,13362]
[64,"64",null,45307,34844,24120,18760,14588]
[65,"65",null,48992,37923,26299,20431,16597]
[66,"66",null,51876,40156,27844,21641,17568]
[67,"67",null,57649,44636,30950,24053,19536]
[68,"68",null,63425,49104,34053,26460,21496]
[69,"69",null,66312,51338,35605,27669,22483]
[70,"70",null,67163,52154,36150,28183,22773]
[71,"71",null,75578,58694,40674,31720,25623]
[72,"72",null,83983,65216,45206,35258,28481]
[73,"73",null,92388,71749,49728,38798,31345]
[74,"74",null,100800,78287,54264,42328,34200]
[75,"75+",null,110269,87300,62236,46336,39241]
[1,"1 Child",null,5020,3582,2630,2283,1653]
[2,"2 Children",null,8168,5644,4147,3616,2438]
[3,"3+ Children",null,11960,8212,6044,5249,3690]
[1,"Rider Comp. Maternidad",null,225,225,225,225,225]
[1,"Transplante de organos",null,300,300,300,300,300]
[]
[]
[]
["TARIFAS SEMESTRALES "]
["EDAD"]
[" "," ",null,"AW2","AW3","AW4","AW5","AW6"]
[18,"18-24",null,{"$f":"+D297*$G$2","v":5975.22},4488.04,3184.2400000000002,2397.7200000000003,1905.88]
[25,"25-29",null,6645.67,5010.62,3549.4100000000003,2680.21,2111.52]
[30,"30-34",null,7691.89,5889.89,4221.45,3183.1800000000003,2452.84]
[35,"35-39",null,8526.11,6552.92,4693.1500000000005,3623.61,2717.31]
[40,"40-44",null,9623.74,7431.13,5325.97,4050.7900000000004,3078.2400000000002]
[45,"45-49",null,11175.050000000001,8555.7900000000009,5999.6,4611.5300000000007,3572.73]
[50,"50-54",null,12249.890000000001,9618.9700000000012,6991.76,5172.2700000000004,3924.65]
[55,"55-59",null,14477.480000000001,11104.560000000001,7733.2300000000005,5993.77,4638.5600000000004]
[60,"60",null,15993.810000000001,12295.470000000001,8509.68,6609.1,5136.76]
[61,"61",null,17999.86,13840.42,9578.16,7443.3200000000006,5786.01]
[62,"62",null,{"$f":"+D307*$G$2","v":20005.38},15383.25,10645.58,8278.6,6434.2000000000007]
[63,"63",null,22007.72,16923.96,11720.95,9109.11,7081.8600000000006]
[64,"64",null,24012.710000000003,18467.32,12783.6,9942.8000000000011,7731.64]
[65,"65",null,25965.760000000002,20099.190000000002,13938.470000000001,10828.43,8796.41]
[66,"66",null,27494.280000000002,21282.68,14757.320000000002,11469.730000000001,9311.0400000000009]
[67,"67",null,30553.97,23657.08,16403.5,12748.09,10354.08]
[68,"68",null,33615.25,26025.120000000003,18048.09,14023.800000000001,11392.880000000001]
[69,"69",null,35145.360000000001,27209.140000000003,18870.650000000001,14664.570000000002,11915.99]
[70,"70",null,35596.39,27641.620000000003,19159.5,14936.990000000002,12069.69]
[71,"71",null,40056.340000000004,31107.820000000003,21557.22,16811.600000000002,13580.19]
[72,"72",null,{"$f":"+D317*$G$2","v":44510.990000000005},34564.480000000003,23959.18,18686.740000000002,15094.93]
[73,"73",null,48965.64,38026.97,26355.84,20562.940000000002,16612.850000000002]
[74,"74",null,53424,41492.11,28759.920000000002,22433.84,18126]
[75,"75+",null,58442.57,46269,32985.08,24558.080000000002,20797.73]
[1,"1 Child",null,2660.6,1898.46,1393.9,1209.99,876.09]
[2,"2 Children",null,4329.04,2991.32,2197.9100000000003,1916.48,1292.1400000000001]
[3,"3+ Children",null,6338.8,4352.3600000000006,3203.32,2781.9700000000003,1955.7]
[1,"Rider Comp. Maternidad",null,119.25,119.25,119.25,119.25,119.25]
[1,"Transplante de organos",null,159,159,159,159,159]
[]
[]
[]
[]
[]
["ADVANTAGE (LATINAMERICA ONLY)"]
["TARIFAS ANUALES"]
["EDAD"]
[" "," ",null,"AL2","AL3","AL4","AL5","AL6"]
[18,"18-24",null,11240,8450,6003,4521,3578]
[25,"25-29",null,12522,9432,6676,5046,3960]
[30,"30-34",null,14491,11087,7953,5984,4611]
[35,"35-39",null,16068,12342,8853,6822,5116]
[40,"40-44",null,18135,13999,10040,7628,5791]
[45,"45-49",null,21074,16127,11319,8682,6734]
[50,"50-54",null,23095,18131,13196,9747,7397]
[55,"55-59",null,27290,20932,14596,11305,8747]
[60,"60",null,30152,23179,16056,12465,9685]
[61,"61",null,33942,26076,18072,14038,10913]
[62,"62",null,37722,29010,20091,15611,12132]
[63,"63",null,41505,31913,22117,17178,13360]
[64,"64",null,45292,34829,24140,18760,14569]
[65,"65",null,48973,37903,26303,20431,16582]
[66,"66",null,51857,40135,27861,21635,17581]
[67,"67",null,57634,44613,30968,24062,19536]
[68,"68",null,63406,49074,34077,26482,21499]
[69,"69",null,66294,51314,35619,27680,22488]
[70,"70",null,67143,52135,36169,28205,22786]
[71,"71",null,75557,58666,40705,31745,25636]
[72,"72",null,83973,65215,45242,35276,28498]
[73,"73",null,92378,71746,49775,38821,31358]
[74,"74",null,100789,78269,54304,42358,34218]
[75,"75+",null,110253,87280,62287,46373,39262]
[1,"1 Child",null,5009,3572,2624,2281,1656]
[2,"2 Children",null,8181,5634,4146,3620,2438]
[3,"3+ Children",null,11967,8220,6057,5241,3690]
[1,"Rider Comp. Maternidad"]
[1,"Transplante de organos"]
[]
["TARIFAS SEMESTRALES "]
["EDAD"]
[" "," ",null,"AL2","AL3","AL4","AL5","AL6"]
[18,"18-24",null,{"$f":"+D370*$G$2","v":5957.2000000000007},4478.5,3181.59,2396.13,1896.3400000000001]
[25,"25-29",null,6636.6600000000008,4998.96,3538.28,2674.38,2098.8000000000002]
[30,"30-34",null,7680.2300000000005,5876.1100000000006,4215.09,3171.52,2443.83]
[35,"35-39",null,8516.0400000000009,6541.26,4692.09,3615.6600000000003,2711.48]
[40,"40-44",null,9611.5500000000011,7419.47,5321.2,4042.84,3069.23]
[45,"45-49",null,11169.220000000001,8547.3100000000013,5999.0700000000006,4601.46,3569.02]
[50,"50-54",null,12240.35,9609.43,6993.88,5165.91,3920.4100000000003]
[55,"55-59",null,14463.7,11093.960000000001,7735.88,5991.6500000000005,4635.91]
[60,"60",null,15980.560000000001,12284.87,8509.68,6606.4500000000007,5133.05]
[61,"61",null,17989.260000000002,13820.28,9578.16,7440.14,5783.89]
[62,"62",null,{"$f":"+D380*$G$2","v":19992.66},15375.300000000001,10648.230000000001,8273.83,6429.96]
[63,"63",null,21997.65,16913.89,11722.01,9104.34,7080.8]
[64,"64",null,24004.760000000002,18459.370000000003,12794.2,9942.8000000000011,7721.5700000000006]
[65,"65",null,25955.690000000002,20088.59,13940.59,10828.43,8788.4600000000009]
[66,"66",null,27484.210000000003,21271.55,14766.33,11466.550000000001,9317.93]
[67,"67",null,30546.02,23644.89,16413.04,12752.86,10354.08]
[68,"68",null,33605.18,26009.22,18060.810000000001,14035.460000000001,11394.470000000001]
[69,"69",null,35135.82,27196.420000000002,18878.07,14670.400000000001,11918.640000000001]
[70,"70",null,35585.79,27631.550000000003,19169.57,14948.650000000001,12076.58]
[71,"71",null,40045.21,31092.980000000003,21573.65,16824.850000000002,13587.08]
[72,"72",null,{"$f":"+D390*$G$2","v":44505.69},34563.950000000004,23978.260000000002,18696.280000000002,15103.94]
[73,"73",null,48960.340000000004,38025.380000000005,26380.75,20575.13,16619.740000000002]
[74,"74",null,53418.170000000006,41482.57,28781.120000000003,22449.74,18135.54]
[75,"75+",null,58434.090000000004,46258.400000000001,33012.11,24577.690000000002,20808.86]
[1,"1 Child",null,2654.77,1893.16,1390.72,1208.93,877.68000000000006]
[2,"2 Children",null,4335.93,2986.02,2197.38,1918.6000000000001,1292.1400000000001]
[3,"3+ Children",null,6342.51,4356.6000000000004,3210.21,2777.73,1955.7]
[1,"Rider Comp. Maternidad",null,0,0,0,0,0]
[1,"Transplante de organos",null,0,0,0,0,0]
[]
[]
[]
[]
["BUPA SECURE CARE INTERNTIONAL"]
["TARIFAS ANUALES"]
["EDAD"]
[" "," ",null,"SE2","SE3","SE4","SE5","SE6"]
[18,"18-24",null,1776,1263,1093,835]
[25,"25-29",null,1977,1407,1216,923]
[30,"30-34",null,2297,1633,1415,1070]
[35,"35-39",null,2552,1814,1569,1188]
[40,"40-44",null,2885,2051,1779,1334]
[45,"45-49",null,3356,2387,2061,1555]
[50,"50-54",null,3684,2619,2265,1696]
[55,"55-59",null,4365,3103,2679,2009]
[60,"60",null,4626,3288,2840,2122]
[61,"61",null,5206,3700,3195,2391]
[62,"62",null,5785,4112,3552,2660]
[63,"63",null,6370,4529,3908,2929]
[64,"64",null,6947,4938,4269,3195]
[65,"65",null,6994,4971,4291,3209]
[66,"66",null,7032,4998,4313,3220]
[67,"67",null,7821,5561,4795,3582]
[68,"68",null,8601,6115,5277,3943]
[69,"69",null,8992,6394,5516,4122]
[70,"70",null,9088,6461,5571,4142]
[71,"71",null,10232,7275,6272,4663]
[72,"72",null,11369,8081,6972,5185]
[73,"73",null,12510,8893,7670,5705]
[74,"74",null,13649,9703,8370,6228]
[75,"75+",null,14928,10611,9151,6801]
[1,"1 Child",null,715,510,437,323]
[2,"2 Children",null,1126,802,693,513]
[3,"3+ Children",null,1637,1165,1005,741]
[1,"Rider Comp. Maternidad",null,225,225,225,225]
[1,"Transplante de organos",null,300,300,300,300]
[]
[]
[]
[]
["TARIFAS SEMESTRALES "]
["EDAD"]
[" "," ",null,"SE2","SE3","SE4","SE5","SE6"]
[18,"18-24",null,{"$f":"+D440*$G$2","v":941.28000000000009},669.39,579.29000000000008,442.55,0]
[25,"25-29",null,1047.81,745.71,644.48,489.19,0]
[30,"30-34",null,1217.4100000000001,865.49,749.95,567.1,0]
[35,"35-39",null,1352.5600000000002,961.42000000000007,831.57,629.64,0]
[40,"40-44",null,1529.0500000000002,1087.03,942.87,707.02,0]
[45,"45-49",null,1778.68,1265.1100000000001,1092.3300000000002,824.15000000000009,0]
[50,"50-54",null,1952.5200000000002,1388.0700000000002,1200.45,898.88,0]
[55,"55-59",null,2313.4500000000003,1644.5900000000001,1419.8700000000001,1064.77,0]
[60,"60",null,2451.7800000000002,1742.64,1505.2,1124.6600000000001,0]
[61,"61",null,2759.1800000000003,1961,1693.3500000000001,1267.23,0]
[62,"62",null,{"$f":"+D450*$G$2","v":3066.05},2179.36,1882.5600000000002,1409.8000000000002,0]
[63,"63",null,3376.1000000000004,2400.3700000000003,2071.2400000000002,1552.3700000000001,0]
[64,"64",null,3681.9100000000003,2617.1400000000003,2262.5700000000002,1693.3500000000001,0]
[65,"65",null,3706.82,2634.63,2274.23,1700.77,0]
[66,"66",null,3726.96,2648.94,2285.8900000000003,1706.6000000000001,0]
[67,"67",null,4145.13,2947.33,2541.35,1898.46,0]
[68,"68",null,4558.5300000000007,3240.9500000000003,2796.81,2089.79,0]
[69,"69",null,4765.76,3388.82,2923.48,2184.6600000000003,0]
[70,"70",null,4816.6400000000003,3424.3300000000004,2952.63,2195.2600000000002,0]
[71,"71",null,5422.96,3855.75,3324.1600000000003,2471.3900000000003,0]
[72,"72",null,{"$f":"+D460*$G$2","v":6025.5700000000006},4282.93,3695.1600000000003,2748.05,0]
[73,"73",null,6630.3,4713.29,4065.1000000000004,3023.65,0]
[74,"74",null,7233.97,5142.59,4436.1000000000004,3300.84,0]
[75,"75+",null,7911.84,5623.83,4850.0300000000007,3604.53,0]
[1,"1 Child",null,378.95000000000005,270.3,231.61,171.19,0]
[2,"2 Children",null,596.78000000000009,425.06,367.29,271.89,0]
[3,"3+ Children",null,867.61,617.45000000000005,532.65,392.73,0]
[1,"Rider Comp. Maternidad",null,119.25,119.25,119.25,119.25,0]
[1,"Transplante de organos",null,159,159,159,159,0]
[]
[]
[]
[]
["ESSENTIAL"]
["TARIFAS ANUALES"]
["EDAD"]
[" "," ",null,"ET2","ET3","ET4","ET5","ET6"]
[18,"18-24",null,7182,5621,4041,3471,2627]
[25,"25-29",null,7920,6336,4508,3874,2917]
[30,"30-34",null,9060,7458,5240,4496,3387]
[35,"35-39",null,9999,8357,5837,4992,3764]
[40,"40-44",null,11213,9531,6600,5653,4248]
[45,"45-49",null,12910,11177,7691,6580,4938]
[50,"50-54",null,14093,12304,8428,7210,5408]
[55,"55-59",null,16571,14694,9995,8558,6393]
[60,"60",null,17350,15706,10582,9057,6761]
[61,"61",null,19520,17686,11915,10197,7632]
[62,"62",null,21702,19656,13263,11344,8482]
[63,"63",null,23897,21628,14594,12490,9345]
[64,"64",null,26080,23615,15926,13628,10199]
[65,"65",null,26106,23831,16027,13703,10238]
[66,"66",null,26132,24057,16126,13772,10272]
[67,"67",null,29046,26744,17913,15313,11422]
[68,"68",null,31967,29435,19716,16856,12580]
[69,"69",null,33424,30762,20622,17627,13156]
[70,"70",null,33470,31278,20830,17798,13224]
[71,"71",null,37683,35210,23453,20036,14885]
[72,"72",null,41883,39131,26075,22279,16552]
[73,"73",null,46079,43055,28685,24513,18229]
[74,"74",null,50277,46970,31302,26758,19876]
[75,"75+",null,54792,51540,34243,29253,21723]
[1,"1 Child",null,3484,2051,1631,1396,1045]
[2,"2 Children",null,5870,3038,2580,2212,1634]
[3,"3+ Children",null,8610,4386,3753,3202,2368]
[1,"Rider Comp. Maternidad",null,225,225,225,225,225]
[1,"Transplante de organos",null,300,300,300,300,300]
[]
[]
[]
["TARIFAS SEMESTRALES "]
["EDAD"]
[" "," ",null,"ET2","ET3","ET4","ET5","ET6"]
[18,"18-24",null,{"$f":"+D513*$G$2","v":3806.46},2979.13,2141.73,1839.63,1392.3100000000002]
[25,"25-29",null,4197.6000000000004,3358.0800000000004,2389.2400000000002,2053.2200000000003,1546.01]
[30,"30-34",null,4801.8,3952.7400000000002,2777.2000000000003,2382.88,1795.1100000000001]
[35,"35-39",null,5299.47,4429.21,3093.61,2645.76,1994.92]
[40,"40-44",null,5942.89,5051.43,3498,2996.09,2251.44]
[45,"45-49",null,6842.3,5923.81,4076.23,3487.4,2617.1400000000003]
[50,"50-54",null,7469.29,6521.12,4466.84,3821.3,2866.2400000000002]
[55,"55-59",null,8782.630000000001,7787.8200000000006,5297.35,4535.74,3388.29]
[60,"60",null,9195.5,8324.18,5608.46,4800.21,3583.3300000000004]
[61,"61",null,10345.6,9373.58,6314.9500000000007,5404.41,4044.96]
[62,"62",null,{"$f":"+D523*$G$2","v":11502.060000000001},10417.68,7029.39,6012.3200000000006,4495.46]
[63,"63",null,12665.41,11462.84,7734.8200000000006,6619.7000000000007,4952.8500000000004]
[64,"64",null,13822.400000000001,12515.95,8440.7800000000007,7222.84,5405.47]
[65,"65",null,13836.18,12630.43,8494.3100000000013,7262.59,5426.14]
[66,"66",null,13849.960000000001,12750.210000000001,8546.7800000000007,7299.1600000000008,5444.16]
[67,"67",null,15394.380000000001,14174.320000000002,9493.8900000000012,8115.89,6053.66]
[68,"68",null,16942.510000000002,15600.550000000001,10449.480000000001,8933.68,6667.4000000000005]
[69,"69",null,17714.72,16303.86,10929.66,9342.3100000000013,6972.68]
[70,"70",null,17739.100000000002,16577.34,11039.900000000001,9432.94,7008.72]
[71,"71",null,19971.990000000002,18661.3,12430.09,10619.08,7889.05]
[72,"72",null,{"$f":"+D533*$G$2","v":22197.99},20739.43,13819.75,11807.87,8772.5600000000013]
[73,"73",null,24421.870000000003,22819.15,15203.050000000001,12991.890000000001,9661.3700000000008]
[74,"74",null,26646.81,24894.100000000002,16590.060000000001,14181.740000000002,10534.28]
[75,"75+",null,29039.760000000002,27316.2,18148.79,15504.09,11513.19]
[1,"1 Child",null,1846.52,1087.03,864.43000000000006,739.88,553.85]
[2,"2 Children",null,3111.1000000000004,1610.14,1367.4,1172.3600000000001,866.0200000000001]
[3,"3+ Children",null,4563.3,2324.58,1989.0900000000001,1697.0600000000002,1255.04]
[1,"Rider Comp. Maternidad",null,119.25,119.25,119.25,119.25,119.25]
[1,"Transplante de organos",null,159,159,159,159,159]
[]
[]
[]
[]
[]
["CRITICAL"]
["TARIFAS ANUALES"]
["EDAD"]
[" "," ","CR1",null,null,"CR2",null,null,"CR3",null,null,"CR4",null,null,"CR5",null,null,"CR6"]
[null,null,"INDIVIDUAL","2 PERSONAS","FAMILIAR","INDIVIDUAL","2 PERSONAS","FAMILIAR","INDIVIDUAL","2 PERSONAS","FAMILIAR","INDIVIDUAL","2 PERSONAS","FAMILIAR","INDIVIDUAL","2 PERSONAS","FAMILIAR","INDIVIDUAL","2 PERSONAS","FAMILIAR"]
[18,"-  49",4167,7342,10498,3376,5750,8144,2876,4953,7024,2283,3830,5391,1707,2763,3816,1089,1629,2147]
[50,"o más",5280,8441,11616,4250,6622,9022,3608,5675,7744,2818,4366,5920,2072,3124,4178,1268,1808,2328]
[]
[]
["TARIFAS SEMESTRALES "]
["EDAD"]
[" "," ","CR1",null,null,"CR2",null,null,"CR3",null,null,"CR4",null,null,"CR5"]
[null,null,"INDIVIDUAL","2 PERSONAS","FAMILIAR","INDIVIDUAL","2 PERSONAS","FAMILIAR","INDIVIDUAL","2 PERSONAS","FAMILIAR","INDIVIDUAL","2 PERSONAS","FAMILIAR","INDIVIDUAL","2 PERSONAS","FAMILIAR"]
[18,"-  25",{"$f":"AO595","v":0},{"$f":"AP595","v":0},0,0,0,0,0,0,0,0,0,0,0,0,0]
[75,"o más",{"$f":"AO596","v":0},0,0,0,0,0,0,0,0,0,0,0,0,0,0]