{"text_format":"1","workbook":"xlsx","n_sheets":5,"sheets":["INGRESO DE DATOS","BUPA ESSENTIAL FLEX 1","BUPA ESSENTIAL FLEX 2","Resumen Tarifas","Tablas"],"not_rendered":{"charts":0,"images":9,"macros":1,"external_links":0,"defined_names":3,"comments":1,"pivot_tables":0},"unopened":[],"bounds":{"document_bytes":16777216,"sheet_cells":100000,"rows_first":2000,"rows_last":500,"rows_between":2000,"halvings":0,"cell_chars":16384,"cell_head_chars":4096},"cells_cut":0,"cells_raw":0,"read":"whole","date_system":"1900"}

{"sheet":"INGRESO DE DATOS","index":0,"n_rows":49,"n_cols":20,"rows_kept":49,"cut":false,"hidden":false,"merged":[[55,3,55,4],[55,6,55,7],[10,0,10,12],[44,0,44,1],[36,0,36,1],[38,0,38,1],[40,0,40,1],[42,0,42,1],[14,10,14,12],[38,4,40,5],[41,4,41,5],[38,7,40,9],[41,7,41,9],[48,0,48,2],[21,20,21,24],[43,11,46,12],[10,14,10,16],[36,2,36,12],[10,18,17,18],[41,14,41,16],[21,14,21,15],[36,14,36,15],[44,14,44,15]]}
[]
[null,null,null,null,null,null,null," "," ",null,null,null,null,null,"24 years",false]
[null,null,null,null,null,null,null,null,null,null,null,null,null,null,"Coaseguro (Panamá)",false]
[]
[]
[null,null,null,null,null,null,null," "," "]
[]
[]
[]
[]
[null,null,null,null,null,null,null,null,null,null,null,null,null,null,"Descuento 24 años (por edad)",null,null,null,"Type","Nuevo Negocio"]
[null,null,null,null,null,null,null,null,null,null,null,null,null,null,"age","Discount (%)","Parameter",null,null,"Renovación"]
[null,null,null,null,null,null,null,null,null,null,null,null,null,null,24,35,{"$f":"1-P13/100","v":0.65}]
[null,null,null,null,null,null,null,null,null,null,null,null,null,null,25,30,{"$f":"1-P14/100","v":0.7}]
[null,null,null,null,null,null,null,null,null,null,null,null,null,null,26,25,0.75]
[null,null,null,null,null,null,null,null,null,null,null,null,null,null,27,20,0.8]
[null,null,null,null,null,null,null,null,null,null,null,null,null,null,28,15,0.85]
[null,null,null,null,null,null,null,null,null,null,null,null,null,null,29,6,0.94]
[null,null,null,null,null,null,null,null,null,null,null,null,null,null,"All ages",0,1,null,"Type selected",2]
[]
[null,null,null,null,null,null,null,false]
[null,null,null,null,null,null,null,null,null,null,null,null,null,null,"NEW BUSINESS DISCOUNT"]
[null,null,null,null,null,null,null,null,null,null,null,null,null,null,"Flex 1","Flex 2"]
[null,null,null,null,null,null,null,null,null,null,null,null,null,null,0,0]
[]
[]
[]
[]
[]
[null,null,null,null,null,null,null,null,null,null,null,null,null,null,"Descuento de 24 años:",{"$f":"IF(P2,_xlfn.SWITCH(C43,O13,Q13,O14,Q14,O15,Q15,O16,Q16,O17,Q17,O18,Q18,Q19),Q19)","v":1}]
{"$rows_left_out":20}
{"sheet":"BUPA ESSENTIAL FLEX 1","index":1,"n_rows":79,"n_cols":24,"rows_kept":79,"cut":false,"hidden":false,"merged":[[0,10,0,21],[0,23,0,34],[78,0,81,7],[40,0,40,1],[41,0,41,1],[42,0,42,1],[45,0,45,1],[46,0,46,1],[58,0,58,1],[69,0,69,1],[71,0,71,1],[59,0,59,1],[60,0,60,1],[65,0,65,7],[66,0,66,1],[67,0,67,1],[72,0,72,1],[4,0,10,7],[20,1,20,2],[12,1,12,7],[18,5,18,6],[56,0,56,1],[34,0,34,1],[35,0,35,1],[36,0,36,1],[37,0,37,1],[39,0,39,7],[22,0,22,2],[25,0,25,1],[26,0,26,1],[28,0,28,7],[73,0,73,1],[74,0,74,1],[75,0,75,1],[76,0,76,1],[44,0,44,1],[57,0,57,1],[70,0,70,1],[47,0,47,1],[48,0,48,1],[49,0,49,1],[50,0,50,1],[52,0,52,7],[53,0,53,1],[54,0,54,1],[55,0,55,1],[68,0,68,1],[16,2,16,3],[61,0,61,1],[62,0,62,1],[63,0,63,1],[33,0,33,1],[30,0,30,1],[31,0,31,1],[29,0,29,1]]}
[" ",null,null,null,null,null,null,null,null,null,"RESUMEN DE BENEFICIOS",null,null,null,null,null,null,null,null,null,null,null,null,"RESUMEN DE BENEFICIOS"]
[]
[]
[]
["Cotización de Seguro Médico Internacional\nBupa Essential Flex 1\nTarifas en US$ | Validas: 1 de enero de 2024"]
[]
[]
[]
[]
[]
[]
[]
["Nombre del Asegurado Titular",{"$f":"+'INGRESO DE DATOS'!$C$37","v":"John Doe"}]
[]
["Número de adultos en la póliza",{"$f":"'INGRESO DE DATOS'!C39","v":1}]
[]
["Número de Dependientes en la póliza",{"$f":"+'INGRESO DE DATOS'!$C$41","v":0},{"$f":"IF('INGRESO DE DATOS'!$P$2=TRUE, \"Cotización para dependiente de 24 años\",\"\")","v":""}]
[]
["Edad del Asegurado Titular",{"$f":"+'INGRESO DE DATOS'!$C$43","v":29},null,null,null,"Edad del/la conyuge",null,{"$f":"+'INGRESO DE DATOS'!$C$45","v":18}]
[]
["Fecha de la cotización",{"$f":"NOW()","v":"2023-12-27T14:24:14.030"}]
[]
[{"$f":"IF('INGRESO DE DATOS'!P3=TRUE,\"Variante con coaseguro fuera del país de residencia: SI\",\"Variante con coaseguro fuera del país de residencia: NO\")","v":"Variante con coaseguro fuera del país de residencia: NO"}]
[]
["DEDUCIBLES",null,"PLAN 1","PLAN 2","PLAN 3","PLAN 4","PLAN 5","PLAN 6"]
["En el país de residencia",null,250,500,1000,2000,5000,10000]
["Fuera del país de residencia",null,500,1000,2000,4000,5000,10000]
[]
["TARIFAS ANUALES"]
["Prima para Asegurado Titular",null,{"$f":"VLOOKUP($B$19,Tablas!$A$6:$H$72,3,TRUE)","v":3004.5315999999998},{"$f":"VLOOKUP($B$19,Tablas!$A$6:$H$72,4,TRUE)","v":2612.5861999999997},{"$f":"VLOOKUP($B$19,Tablas!$A$6:$H$72,5,TRUE)","v":2381.5567999999998},{"$f":"VLOOKUP($B$19,Tablas!$A$6:$H$72,6,TRUE)","v":1930.992},{"$f":"VLOOKUP($B$19,Tablas!$A$6:$H$72,7,TRUE)","v":1429.8535999999999},{"$f":"VLOOKUP($B$19,Tablas!$A$6:$H$72,8,TRUE)","v":1206.8699999999999}]
{"$rows_left_out":50}
{"sheet":"BUPA ESSENTIAL FLEX 2","index":2,"n_rows":79,"n_cols":24,"rows_kept":79,"cut":false,"hidden":false,"merged":[[0,10,0,21],[0,23,0,34],[4,0,10,7],[12,1,12,7],[18,5,18,6],[16,2,16,3],[20,1,20,2],[22,0,22,2],[37,0,37,1],[25,0,25,1],[26,0,26,1],[28,0,28,7],[29,0,29,1],[30,0,30,1],[31,0,31,1],[33,0,33,1],[34,0,34,1],[35,0,35,1],[36,0,36,1],[52,0,52,7],[39,0,39,7],[40,0,40,1],[41,0,41,1],[42,0,42,1],[44,0,44,1],[45,0,45,1],[46,0,46,1],[47,0,47,1],[48,0,48,1],[49,0,49,1],[50,0,50,1],[65,0,65,7],[53,0,53,1],[54,0,54,1],[55,0,55,1],[56,0,56,1],[57,0,57,1],[58,0,58,1],[59,0,59,1],[60,0,60,1],[61,0,61,1],[62,0,62,1],[63,0,63,1],[78,0,81,7],[66,0,66,1],[67,0,67,1],[68,0,68,1],[69,0,69,1],[70,0,70,1],[71,0,71,1],[72,0,72,1],[73,0,73,1],[74,0,74,1],[75,0,75,1],[76,0,76,1]]}
[" ",null,null,null,null,null,null,null,null,null,"RESUMEN DE BENEFICIOS",null,null,null,null,null,null,null,null,null,null,null,null,"RESUMEN DE BENEFICIOS"]
[]
[]
[]
["Cotización de Seguro Médico Internacional\nBupa Essential Flex 2\nTarifas en US$ | Validas: 1 de enero de 2024"]
[]
[]
[]
[]
[]
[]
[]
["Nombre del Asegurado Titular",{"$f":"+'INGRESO DE DATOS'!$C$37","v":"John Doe"}]
[]
["Número de adultos en la póliza",{"$f":"'INGRESO DE DATOS'!C39","v":1}]
[]
["Número de Dependientes en la póliza",{"$f":"+'INGRESO DE DATOS'!$C$41","v":0},{"$f":"IF('INGRESO DE DATOS'!$P$2=TRUE, \"Cotización para dependiente de 24 años\",\"\")","v":""}]
[]
["Edad del Asegurado Titular",{"$f":"+'INGRESO DE DATOS'!$C$43","v":29},null,null,null,"Edad del/la conyuge",null,{"$f":"+'INGRESO DE DATOS'!$C$45","v":18}]
[]
["Fecha de la cotización",{"$f":"NOW()","v":"2023-12-27T14:24:14.030"}]
[]
[{"$f":"IF('INGRESO DE DATOS'!P3=TRUE,\"Variante con coaseguro fuera del país de residencia: SI\",\"Variante con coaseguro fuera del país de residencia: NO\")","v":"Variante con coaseguro fuera del país de residencia: NO"}]
[]
["DEDUCIBLES",null,"PLAN 1","PLAN 2","PLAN 3","PLAN 4","PLAN 5","PLAN 6"]
["En el país de residencia",null,250,500,1000,2000,5000,10000]
["Fuera del país de residencia",null,500,1000,2000,4000,5000,10000]
[]
["TARIFAS ANUALES"]
["Prima para Asegurado Titular",null,{"$f":"VLOOKUP($B$19,Tablas!$A$1515:$H$1581,3,TRUE)","v":2404.5448000000001},{"$f":"VLOOKUP($B$19,Tablas!$A$1515:$H$1581,4,TRUE)","v":2089.6091999999999},{"$f":"VLOOKUP($B$19,Tablas!$A$1515:$H$1581,5,TRUE)","v":1904.5557999999999},{"$f":"VLOOKUP($B$19,Tablas!$A$1515:$H$1581,6,TRUE)","v":1544.7936},{"$f":"VLOOKUP($B$19,Tablas!$A$1515:$H$1581,7,TRUE)","v":1144.8024},{"$f":"VLOOKUP($B$19,Tablas!$A$1515:$H$1581,8,TRUE)","v":966.6454}]
{"$rows_left_out":50}
{"sheet":"Resumen Tarifas","index":3,"n_rows":64,"n_cols":7,"rows_kept":64,"cut":false,"hidden":false,"merged":[[37,0,37,6],[16,2,16,3],[0,0,3,5],[20,1,20,2],[63,0,70,6],[27,0,27,6],[23,0,23,6],[29,0,29,6],[33,0,33,6],[18,4,18,5],[12,1,12,6],[4,0,10,6],[57,0,57,6],[43,0,43,6],[47,0,47,6],[49,0,49,6],[53,0,53,6]]}
[" "]
[]
[]
[]
["Cotización de Seguro Médico Internacional\nGlobal Major Health Plans\nResumen de Tarifas\nTarifas en US$ | Validas: 1 de enero de 2024"]
[]
[]
[]
[]
[]
[]
[]
["Nombre del Asegurado Titular",{"$f":"+'INGRESO DE DATOS'!$C$37","v":"John Doe"}]
[]
["Número de adultos en la póliza",{"$f":"+'INGRESO DE DATOS'!$C$39","v":1}]
[]
["Número de Dependientes en la póliza",{"$f":"+'INGRESO DE DATOS'!$C$41","v":0},{"$f":"IF('INGRESO DE DATOS'!$P$2=TRUE, \"Cotización para dependiente de 24 años\",\"\")","v":""}]
[]
["Edad del Asegurado Titular",{"$f":"+'INGRESO DE DATOS'!$C$43","v":29},null,null,"Edad del/la conyuge",null,{"$f":"+'INGRESO DE DATOS'!$C$45","v":18}]
[]
["Fecha de la cotización",{"$f":"NOW()","v":"2023-12-27T14:24:14.030"}]
[]
[]
["BUPA ESSENTIAL FLEX 1"]
["DEDUCIBLES","PLAN 1","PLAN 2","PLAN 3","PLAN 4","PLAN 5","PLAN 6"]
["En el país de residencia",250,500,1000,2000,5000,10000]
["Fuera del país de residencia",500,1000,2000,4000,5000,10000]
["TARIFAS ANUALES"]
["Costo Annual",{"$f":"'BUPA ESSENTIAL FLEX 1'!C38","v":3062.0015999999996},{"$f":"'BUPA ESSENTIAL FLEX 1'!D38","v":2670.0561999999995},{"$f":"'BUPA ESSENTIAL FLEX 1'!E38","v":2439.0267999999996},{"$f":"'BUPA ESSENTIAL FLEX 1'!F38","v":1988.462},{"$f":"'BUPA ESSENTIAL FLEX 1'!G38","v":1487.3235999999999},{"$f":"'BUPA ESSENTIAL FLEX 1'!H38","v":1264.3399999999999}]
["TARIFAS SEMESTRALES"]
{"$rows_left_out":35}
{"sheet":"Tablas","index":4,"n_rows":1808,"n_cols":25,"rows_kept":1808,"cut":false,"hidden":true,"merged":[[1282,0,1282,6],[1283,0,1283,6],[1285,0,1285,1],[1284,2,1284,6],[1435,0,1435,6],[1437,0,1437,1],[1436,2,1436,6],[1357,0,1357,6],[1358,0,1358,6],[1360,0,1360,1],[1359,2,1359,6],[1434,0,1434,6],[1059,0,1059,1],[1058,2,1058,6],[1133,0,1133,6],[1134,0,1134,6],[1136,0,1136,1],[1135,2,1135,6],[1208,0,1208,6],[1210,0,1210,1],[1209,2,1209,6],[907,0,907,6],[908,0,908,6],[910,0,910,1],[909,2,909,6],[982,0,982,6],[984,0,984,1],[983,2,983,6],[1056,0,1056,6],[1057,0,1057,6],[226,0,226,6],[228,0,228,1],[377,0,377,6],[227,2,227,6],[302,0,302,6],[303,0,303,6],[305,0,305,1],[304,2,304,6],[1,0,1,6],[2,0,2,6],[78,0,78,1],[77,2,77,6],[4,0,4,1],[3,2,3,6],[2,12,2,13],[3,12,3,13],[1,8,1,9],[1,20,1,22],[758,0,758,1],[757,2,757,6],[830,0,830,6],[529,0,529,6],[453,0,453,6],[456,0,456,1],[455,2,455,6],[528,0,528,6],[379,0,379,1],[378,2,378,6],[151,0,151,6],[152,0,152,6],[154,0,154,1],[531,0,531,1],[530,2,530,6],[603,0,603,6],[604,0,604,6],[605,0,605,1],[605,2,605,6],[756,0,756,6],[454,0,454,7],[681,0,681,7],[1513,0,1513,1],[1513,9,1513,14],[1513,17,1513,22],[4,9,4,14],[4,17,4,22],[76,0,76,7],[1136,8,1136,9],[1136,11,1136,12],[154,8,154,11],[154,13,154,16],[305,8,305,11],[305,13,305,16],[910,8,910,10],[910,12,910,14],[833,0,833,1],[832,2,832,6],[680,0,680,6],[683,0,683,1],[682,2,682,6],[755,0,755,6],[831,0,831,6],[153,2,153,6],[1736,2,1736,6],[1737,0,1737,1],[1510,0,1510,6],[1512,0,1512,7],[1511,0,1511,7],[1734,0,1734,6],[1735,0,1735,7],[1659,0,1659,6],[1660,0,1660,7],[1661,2,1661,6],[1662,0,1662,1],[1585,0,1585,7],[1586,2,1586,6],[1587,0,1587,1]]}
[]
["BUPA FLEX 1",null,null,null,null,null,null,null,"FACTOR MENSUAL:",null,8.8333333333333333E-2,null,"Descuento de 24 años",{"$f":"'INGRESO DE DATOS'!P30","v":1},"Flex 1","Flex 2",null,null,null,null,"Impuesto (14.94%)",null,null,{"$f":"14.94/100+1","v":1.1494},{"$f":"X2*50","v":57.47}]
["TARIFAS ANUALES",null,null,null,null,null,null,null,"FACTOR TRIMESTRAL:",null,0.26124999999999998,null,"Descuento de producto (%)",null,{"$f":"'INGRESO DE DATOS'!O39","v":0},{"$f":"'INGRESO DE DATOS'!P39","v":0}]
[null,null,null,null,null,null,null,null,"FACTOR SEMIANUAL:",null,0.51500000000000001,null,"Factor para el descuento combinado",null,{"$f":"'INGRESO DE DATOS'!O47","v":1},{"$f":"'INGRESO DE DATOS'!P47","v":1}]
["EDAD",null,250,500,1000,2000,5000,10000,null,"TARIFAS BASE",null,null,null,null,null,null,null,"TARIFAS BASE CON DESCUENTO"]
[18,null,{"$f":"R6*$X$2","v":2502.2437999999997},2176.9636,1982.7149999999999,1533.2996000000001,1168.9397999999999,987.33460000000002,null,2177,1894,1725,1334,1017,859,null,null,{"$f":"J6*$O$4","v":2177},{"$f":"K6*$O$4","v":1894},1725,1334,1017,859]
[19,null,{"$f":"R7*$X$2","v":2542.4728},{"$f":"S7*$X$2","v":2213.7444},{"$f":"T7*$X$2","v":2020.6451999999999},{"$f":"U7*$X$2","v":1565.4828},{"$f":"V7*$X$2","v":1189.6289999999999},{"$f":"W7*$X$2","v":1004.5756},null,2212,1926,1758,1362,1035,874,null,null,{"$f":"J7*$O$4","v":2212},{"$f":"K7*$O$4","v":1926},{"$f":"L7*$O$4","v":1758},{"$f":"M7*$O$4","v":1362},{"$f":"N7*$O$4","v":1035},{"$f":"O7*$O$4","v":874}]
[20,null,2589.5981999999999,2249.3757999999998,2050.5295999999998,1602.2636,1212.617,1022.966,null,2253,1957,1784,1394,1055,890,null,null,2253,1957,1784,1394,1055,890]
[21,null,2628.6777999999999,2289.6048000000001,2083.8622,1634.4467999999999,1234.4556,1041.3563999999999,null,2287,1992,1813,1422,1074,906,null,null,2287,1992,1813,1422,1074,906]
[22,null,2673.5043999999998,2330.9832000000001,2120.643,1666.6299999999999,1256.2942,1060.8961999999999,null,2326,2028,1845,1450,1093,923,null,null,2326,2028,1845,1450,1093,923]
[23,null,2720.6298000000002,2366.6145999999999,2158.5731999999998,1706.8589999999999,1280.4315999999999,1080.4359999999999,null,2367,2059,1878,1485,1114,940,null,null,2367,2059,1878,1485,1114,940]
[24,null,2766.6057999999998,2405.6941999999999,2194.2046,1741.3409999999999,1302.2701999999999,1098.8263999999999,null,2407,2093,1909,1515,1133,956,null,null,2407,2093,1909,1515,1133,956]
[25,null,2806.8348000000001,2440.1761999999999,2228.6866,1775.8229999999999,1328.7064,1121.8144,null,2442,2123,1939,1545,1156,976,null,null,2442,2123,1939,1545,1156,976]
[26,null,2851.6614,2481.5545999999999,2264.3179999999998,1813.7531999999999,1351.6943999999999,1141.3542,null,2481,2159,1970,1578,1176,993,null,null,2481,2159,1970,1578,1176,993]
[27,null,2899.9362000000001,2520.6342,2298.8000000000002,1842.4882,1372.3835999999999,1157.4458,null,2523,2193,2000,1603,1194,1007,null,null,2523,2193,2000,1603,1194,1007]
[28,null,2950.5097999999998,2566.6102000000001,2337.8795999999998,1889.6135999999999,1403.4174,1183.8820000000001,null,2567,2233,2034,1644,1221,1030,null,null,2567,2233,2034,1644,1221,1030]
[29,null,3004.5315999999998,2612.5861999999997,2381.5567999999998,1930.992,1429.8535999999999,1206.8699999999999,null,2614,2273,2072,1680,1244,1050,null,null,2614,2273,2072,1680,1244,1050]
[30,null,3056.2545999999998,2653.9645999999998,2420.6363999999999,1974.6692,1462.0367999999999,1233.3062,null,2659,2309,2106,1718,1272,1073,null,null,2659,2309,2106,1718,1272,1073]
[31,null,3105.6788000000001,2705.6875999999997,2465.4629999999997,2020.6451999999999,1487.3235999999999,1253.9954,null,2702,2354,2145,1758,1294,1091,null,null,2702,2354,2145,1758,1294,1091]
[32,null,3157.4018000000001,2748.2154,2503.3932,2066.6212,1518.3573999999999,1281.5809999999999,null,2747,2391,2178,1798,1321,1115,null,null,2747,2391,2178,1798,1321,1115]
[33,null,3242.4573999999998,2821.777,2575.8053999999997,2127.5394000000001,1566.6322,1322.9594,null,2821,2455,2241,1851,1363,1151,null,null,2821,2455,2241,1851,1363,1151]
[34,null,3328.6624000000002,2899.9362000000001,2643.62,2187.3081999999999,1608.0106000000001,1356.2919999999999,null,2896,2523,2300,1903,1399,1180,null,null,2896,2523,2300,1903,1399,1180]
[35,null,3418.3155999999999,2972.3483999999999,2711.4346,2250.5252,1653.9866,1395.3715999999999,null,2974,2586,2359,1958,1439,1214,null,null,2974,2586,2359,1958,1439,1214]
[36,null,3502.2217999999998,3050.5075999999999,2779.2491999999997,2314.8915999999999,1698.8132000000001,1434.4512,null,3047,2654,2418,2014,1478,1248,null,null,3047,2654,2418,2014,1478,1248]
[37,null,3587.2773999999999,3121.7703999999999,2849.3625999999999,2380.4074000000001,1742.4903999999999,1468.9331999999999,null,3121,2716,2479,2071,1516,1278,null,null,3121,2716,2479,2071,1516,1278]
[38,null,3679.2293999999997,3196.4814000000001,2918.3265999999999,2448.2219999999998,1787.317,1506.8634,null,3201,2781,2539,2130,1555,1311,null,null,3201,2781,2539,2130,1555,1311]
[39,null,3764.2849999999999,3274.6405999999997,2986.1412,2514.8872000000001,1833.2929999999999,1545.943,null,3275,2849,2598,2188,1595,1345,null,null,3275,2849,2598,2188,1595,1345]
[40,null,3860.8346000000001,3352.7997999999998,3056.2545999999998,2580.4029999999998,1879.269,1585.0226,null,3359,2917,2659,2245,1635,1379,null,null,3359,2917,2659,2245,1635,1379]
[41,null,4075.7723999999998,3542.4508000000001,3235.5610000000001,2736.7213999999999,1986.1632,1675.8252,null,3546,3082,2815,2381,1728,1458,null,null,3546,3082,2815,2381,1728,1458]
[42,null,4167.7244000000001,3621.7593999999999,3302.2262000000001,2805.6853999999998,2032.1392000000001,1714.9048,null,3626,3151,2873,2441,1768,1492,null,null,3626,3151,2873,2441,1768,1492]
{"$rows_left_out":1778}